#165 can't install because of error with make

open
nobody
5
2012-11-29
2006-10-03
Anonymous
No

Below is a segment of the error codes displayed when I
execute the ./make command

xwin.c: In function ‘ui_seamless_restack_window’:
xwin.c:3559: error: ‘Window’ undeclared (first use in
this function)
xwin.c:3559: warning: statement with no effect
xwin.c:3559: error: expected ‘;’ before ‘wnds’
xwin.c:3569: error: ‘wnds’ undeclared (first use in
this function)
xwin.c:3569: error: ‘seamless_window’ has no member
named ‘wnd’
xwin.c:3569: warning: assignment makes integer from
pointer without a cast
xwin.c:3570: error: ‘seamless_window’ has no member
named ‘wnd’
xwin.c:3570: warning: assignment makes integer from
pointer without a cast
xwin.c:3572: warning: implicit declaration of function
‘XRestackWindows’
xwin.c:3572: error: ‘g_display’ undeclared (first use
in this function)
xwin.c:3576: warning: implicit declaration of function
‘XRaiseWindow’
xwin.c:3576: error: ‘seamless_window’ has no member
named ‘wnd’
xwin.c: In function ‘ui_seamless_settitle’:
xwin.c:3599: error: ‘g_display’ undeclared (first use
in this function)
xwin.c:3599: error: ‘seamless_window’ has no member
named ‘wnd’
xwin.c:3600: error: ‘seamless_window’ has no member
named ‘wnd’
xwin.c: In function ‘ui_seamless_setstate’:
xwin.c:3623: warning: implicit declaration of function
‘ewmh_change_state’
xwin.c:3623: error: ‘seamless_window’ has no member
named ‘wnd’
xwin.c:3624: error: ‘g_display’ undeclared (first use
in this function)
xwin.c:3624: error: ‘seamless_window’ has no member
named ‘wnd’
xwin.c:3632: error: ‘seamless_window’ has no member
named ‘state’
xwin.c:3632: warning: comparison between pointer and
integer
xwin.c:3634: error: ‘XWMHints’ undeclared (first use in
this function)
xwin.c:3634: error: ‘hints’ undeclared (first use in
this function)
xwin.c:3634: error: invalid operands to binary *
xwin.c:3634: warning: statement with no effect
xwin.c:3635: warning: implicit declaration of function
‘XGetWMHints’
xwin.c:3635: error: ‘seamless_window’ has no member
named ‘wnd’
xwin.c:3635: warning: statement with no effect
xwin.c:3638: error: request for member ‘flags’ in
something not a structure or union
xwin.c:3638: error: ‘StateHint’ undeclared (first use
in this function)
xwin.c:3638: warning: statement with no effect
xwin.c:3639: error: request for member ‘initial_state’
in something not a structure or union
xwin.c:3639: error: ‘IconicState’ undeclared (first use
in this function)
xwin.c:3639: warning: statement with no effect
xwin.c:3640: error: ‘seamless_window’ has no member
named ‘wnd’
xwin.c:3643: error: ‘seamless_window’ has no member
named ‘wnd’
xwin.c:3646: warning: implicit declaration of function
‘XIconifyWindow’
xwin.c:3646: error: ‘seamless_window’ has no member
named ‘wnd’
xwin.c:3653: error: ‘seamless_window’ has no member
named ‘state’
xwin.c:3653: warning: statement with no effect
xwin.c: In function ‘ui_seamless_syncbegin’:
xwin.c:3666: error: ‘g_display’ undeclared (first use
in this function)
xwin.c:3666: error: ‘seamless_window’ has no member
named ‘wnd’
xwin.c: In function ‘ui_seamless_ack’:
xwin.c:3676: error: ‘seamless_window’ has no member
named ‘next’
xwin.c:3676: warning: assignment from incompatible
pointer type
xwin.c:3678: error: ‘seamless_window’ has no member
named ‘outstanding_position’xwin.c:3678: error:
‘seamless_window’ has no member named ‘outpos_serial’
xwin.c:3678: warning: comparison between pointer and
integer
xwin.c:3680: error: ‘seamless_window’ has no member
named ‘xoffset’
xwin.c:3680: error: ‘seamless_window’ has no member
named ‘outpos_xoffset’
xwin.c:3680: warning: statement with no effect
xwin.c:3681: error: ‘seamless_window’ has no member
named ‘yoffset’
xwin.c:3681: error: ‘seamless_window’ has no member
named ‘outpos_yoffset’
xwin.c:3681: warning: statement with no effect
xwin.c:3682: error: ‘seamless_window’ has no member
named ‘width’
xwin.c:3682: error: ‘seamless_window’ has no member
named ‘outpos_width’
xwin.c:3682: warning: statement with no effect
xwin.c:3683: error: ‘seamless_window’ has no member
named ‘height’
xwin.c:3683: error: ‘seamless_window’ has no member
named ‘outpos_height’
xwin.c:3683: warning: statement with no effect
xwin.c:3684: error: ‘seamless_window’ has no member
named ‘outstanding_position’xwin.c:3684: warning:
statement with no effect
xwin.c:3689: error: ‘g_display’ undeclared (first use
in this function)
xwin.c:3689: error: ‘g_backstore’ undeclared (first use
in this function)
xwin.c:3690: error: ‘seamless_window’ has no member
named ‘wnd’
xwin.c:3690: error: ‘g_gc’ undeclared (first use in
this function)
xwin.c:3691: error: ‘seamless_window’ has no member
named ‘xoffset’
xwin.c:3691: error: ‘seamless_window’ has no member
named ‘yoffset’
xwin.c:3691: error: ‘seamless_window’ has no member
named ‘width’
xwin.c:3691: error: ‘seamless_window’ has no member
named ‘height’
make: *** [xwin.o] Error 1
joeyxsuse:/home/joey/rdesktop-1.5.0 #

I'm not sure how to resolve this issue? Thanks
joeykrim@gmail.com

Discussion

  • Logged In: NO

    I get the same thing. Anybody planning on responding to this? It's been almost 2 months.

     
  • Brad Hards
    Brad Hards
    2006-11-25

    Logged In: YES
    user_id=13687
    Originator: NO

    Have you installed libX11-devel package? Are you pasting the whole error log (try starting at the compiler execution line, not with the error)?

    What type of system are you trying to build this on?

     
  • Logged In: NO

    I get the same error. I am running on a Ubuntu 6.1 machine running on VMWare. All else seems fine.

     
  • Logged In: NO

    I get the same error. I am running on a Ubuntu 6.1 machine running on VMWare. All else seems fine.

     
  • Logged In: NO

    I fixed it by installing libx11-dev and then running make again.

    Ubuntu 6.1

     
  • Logged In: NO

    Thank You to "nobody" and bradh!
    I'm running SUSE 10.3. I also fixed it by installing package xorg-X11lib-devel.

     
  • Logged In: NO

    Did you run bootstrap and configure before make? Looks to me you're missing the includes.