#3 Failed build on freebsd

open
nobody
None
5
2006-12-07
2006-12-07
Anonymous
No

Python 2.4

########

Magick version = 6.2.5

########

['/usr/local/lib'] ['/usr/local/include']
running install
running build
running build_ext
building 'magick' extension
cc -fno-strict-aliasing -DNDEBUG -O -pipe -D__wchar_t=wchar_t -DTHREAD_STACK_SIZE=0x20000 -fPIC -I/usr/local/include -I/usr/local/include/python2.4 -c imageobject.c -o build/temp.freebsd-5.4-RELEASE-i386-2.4/imageobject.o
imageobject.c: In function `index_image':
imageobject.c:3724: error: structure has no member named `class'
imageobject.c: In function `pixelcolor_image':
imageobject.c:3804: error: structure has no member named `class'
imageobject.c:3813: error: structure has no member named `class'
imageobject.c:3816: error: structure has no member named `class'
imageobject.c: In function `getindexes_image':
imageobject.c:4002: error: structure has no member named `class'
imageobject.c: In function `setindexes_image':
imageobject.c:4072: error: structure has no member named `class'
error: command 'cc' failed with exit status 1

Discussion