#611 pdp_opencv fails to build with opencv 2.1

pending-fixed
externals (233)
5
2013-01-07
2010-10-16
No

Build log:

http://launchpadlibrarian.net/57745105/buildlog_ubuntu-maverick-i386.pd-pdp-opencv_0.2%2Bsvn20101006-1~ppa1~maverick1_FAILEDTOBUILD.txt.gz

Relevant excerpts:

----8<----
Setting up libcv-dev (2.1.0-2) ...
Setting up libcvaux2.1 (2.1.0-2) ...
Setting up libcvaux-dev (2.1.0-2) ...
---8<----

----8<----
g++ -fPIC -DPD -O2 -funroll-loops -fomit-frame-pointer -ffast-math -Wall -W -Wno-unused -Wno-parentheses -Wno-switch -DGEM_OPENCV_VERSION=\"0.2\" -g -I/build/buildd/pd-pdp-opencv-0.2+svn20101006/debian/bundled/src -I. -I/usr/include/pdp `pkg-config --cflags opencv` -o pdp_opencv_pgh_compare.o -c pdp_opencv_pgh_compare.cc
pdp_opencv_pgh_compare.cc: In function 'void pdp_opencv_pgh_compare_process_rgb(t_pdp_opencv_pgh_compare*)':
pdp_opencv_pgh_compare.cc:131: error: 'cvCalcPGH' was not declared in this scope
make[1]: *** [pdp_opencv_pgh_compare.o] Error 1
----8<----

Discussion


Anonymous


Cancel   Add attachments