Hi

Trying to build phpqt on karmic -- cmake runs ok but make fails with the following error (below).

Looks like for some reason it can't generate smokedata.cpp ?
"c++: /home/build/src/phpqt/build/smoke/qt/smokedata.cpp: No such file or directory"

I'm using phpqt from svn using the build.sh script.

Thanks for any help that can be provided, I'm stumped!

James



/home/build/src/phpqt/build$ make
[  0%] Generating smokedata.cpp, x_1.cpp, x_2.cpp, x_3.cpp, x_4.cpp, x_5.cpp, x_6.cpp, x_7.cpp, x_8.cpp, x_9.cpp, x_10.cpp, x_11.cpp, x_12.cpp, x_13.cpp, x_14.cpp, x_15.cpp, x_16.cpp, x_17.cpp, x_18.cpp, x_19.cpp, x_20.cpp
Usage:
  generator [options] header-file typesystem-file

Available options:

General:
  --debug-level=[sparse|medium|full]
  --dump-object-tree
  --help, -h or -?
  --no-suppress-warnings
  --output-directory=[dir]
  --include-paths=<path>[:<path>:...]
  --print-stdout
QtScript:
  --nothing-to-report-yet
Scanning dependencies of target smokeqt
[  0%] Generating smokedata.cpp, x_1.cpp, x_2.cpp, x_3.cpp, x_4.cpp, x_5.cpp, x_6.cpp, x_7.cpp, x_8.cpp, x_9.cpp, x_10.cpp, x_11.cpp, x_12.cpp, x_13.cpp, x_14.cpp, x_15.cpp, x_16.cpp, x_17.cpp, x_18.cpp, x_19.cpp, x_20.cpp
Usage:
  generator [options] header-file typesystem-file

Available options:

General:
  --debug-level=[sparse|medium|full]
  --dump-object-tree
  --help, -h or -?
  --no-suppress-warnings
  --output-directory=[dir]
  --include-paths=<path>[:<path>:...]
  --print-stdout
QtScript:
  --nothing-to-report-yet
[  0%] Building CXX object smoke/qt/CMakeFiles/smokeqt.dir/smokedata.cpp.o
c++: /home/build/src/phpqt/build/smoke/qt/smokedata.cpp: No such file or directory
c++: no input files
make[2]: *** [smoke/qt/CMakeFiles/smokeqt.dir/smokedata.cpp.o] Error 1
make[1]: *** [smoke/qt/CMakeFiles/smokeqt.dir/all] Error 2
make: *** [all] Error 2