Work at SourceForge, help us to make it a better place! We have an immediate need for a Support Technician in our San Francisco or Denver office.

Close

#13 won't compile on fedora 11

v1.0 (example)
closed-fixed
nobody
5
2009-07-12
2009-06-20
Joshua Green
No

Current cvs won't compile on Fedora 11. ./configure runs fine, but make stops shortly after starting with an error.

Making all in plugins/dfinput
make[1]: Entering directory `/home/mythtv/Games/Emulators/pcsx-df/plugins/dfinput'
/bin/sh ../../libtool --tag=CC --mode=compile gcc -DHAVE_CONFIG_H -I. -I../../include -Wall -g -DPIXMAPDIR=\"/usr/local/share/pixmaps/\" -DLOCALE_DIR=\"/usr/local/share/locale/\" -DDATADIR=\"/usr/local/share/psemu/\" -I/usr/include/gtk-2.0 -I/usr/lib/gtk-2.0/include -I/usr/include/atk-1.0 -I/usr/include/cairo -I/usr/include/pango-1.0 -I/usr/include/glib-2.0 -I/usr/lib/glib-2.0/include -I/usr/include/pixman-1 -I/usr/include/freetype2 -I/usr/include/libpng12 -I/usr/include/libglade-2.0 -I/usr/include/gtk-2.0 -I/usr/include/libxml2 -I/usr/lib/gtk-2.0/include -I/usr/include/atk-1.0 -I/usr/include/cairo -I/usr/include/pango-1.0 -I/usr/include/glib-2.0 -I/usr/lib/glib-2.0/include -I/usr/include/pixman-1 -I/usr/include/freetype2 -I/usr/include/libpng12 -DVER=0 -DREVISION=2 -DBUILD=0 -g -O2 -MT pad.lo -MD -MP -MF .deps/pad.Tpo -c -o pad.lo pad.c
libtool: compile: gcc -DHAVE_CONFIG_H -I. -I../../include -Wall -g -DPIXMAPDIR=\"/usr/local/share/pixmaps/\" -DLOCALE_DIR=\"/usr/local/share/locale/\" -DDATADIR=\"/usr/local/share/psemu/\" -I/usr/include/gtk-2.0 -I/usr/lib/gtk-2.0/include -I/usr/include/atk-1.0 -I/usr/include/cairo -I/usr/include/pango-1.0 -I/usr/include/glib-2.0 -I/usr/lib/glib-2.0/include -I/usr/include/pixman-1 -I/usr/include/freetype2 -I/usr/include/libpng12 -I/usr/include/libglade-2.0 -I/usr/include/gtk-2.0 -I/usr/include/libxml2 -I/usr/lib/gtk-2.0/include -I/usr/include/atk-1.0 -I/usr/include/cairo -I/usr/include/pango-1.0 -I/usr/include/glib-2.0 -I/usr/lib/glib-2.0/include -I/usr/include/pixman-1 -I/usr/include/freetype2 -I/usr/include/libpng12 -DVER=0 -DREVISION=2 -DBUILD=0 -g -O2 -MT pad.lo -MD -MP -MF .deps/pad.Tpo -c pad.c -fPIC -DPIC -o .libs/pad.o
pad.c:47: error: ‘VERSION’ undeclared here (not in a function)
pad.c: In function ‘PADopen’:
pad.c:186: warning: implicit declaration of function ‘XkbSetDetectableAutoRepeat’
pad.c: In function ‘getPendingEvents’:
pad.c:454: warning: assignment from incompatible pointer type
make[1]: *** [pad.lo] Error 1
make[1]: Leaving directory `/home/mythtv/Games/Emulators/pcsx-df/plugins/dfinput'
make: *** [all-recursive] Error 1

Discussion

  • Andrew Burton
    Andrew Burton
    2009-07-12

    Not specific to Fedora; fixed constant error in dfinput plugin.

     
  • Andrew Burton
    Andrew Burton
    2009-07-12

    • status: open --> closed-fixed