make failed

Help
Germel
2005-10-14
2013-04-24
  • Germel
    Germel
    2005-10-14

    make failed in compiling pas2dox under Linux Debian. I would be very happy about any hint!

    Version of pas2dox:0.42alpha.

    Here are the error messages:

    $ make
    g++ pas2dox.cpp -o pas2dox
    pas2dox.l: In function `void PushText(const char*)':
    pas2dox.l:2684: error: `yytext_ptr' undeclared (first use this function)
    pas2dox.l:2684: error: (Each undeclared identifier is reported only once for
       each function it appears in.)
    pas2dox.l: In function `void codeYYdummy()':
    pas2dox.l:2797: error: `yy_flex_realloc' undeclared (first use this function)
    make: *** [pas2dox] Error 1

     
    • Since you didn't mention it I guess you didn't use the patches that are available in the "Patches" section here?
      And you are using flex 2.5.4?
      Just try the patches.