#71 make check stopped with error

open
nobody
None
5
2010-05-01
2010-05-01
Josef
No

Hello,

I tried to compile the cvs-source on KDE 4.3.5, x86_64-suse-linux,
gcc version 4.4.1 [gcc-4_4-branch revision 150839] (SUSE Linux),

on make check it the compiler aborted with

gpar2.cc: In function ‘int main(int, char**)’:
gpar2.cc:11: error: ‘bindtextdomain’ was not declared in this scope
gpar2.cc:12: error: ‘bind_textdomain_codeset’ was not declared in this scope
gpar2.cc:13: error: ‘textdomain’ was not declared in this scope
gpar2.cc:22: warning: deprecated conversion from string constant to ‘char*’
make[1]: *** [gpar2.o] error 1
make[1]: Leaving directory `/home/sources/gpar2'
make: *** [check-recursive] error 1

bye
al

Discussion