Work at SourceForge, help us to make it a better place! We have an immediate need for a Support Technician in our San Francisco or Denver office.

Close

#11 latest snapshot doesn't compiles on Fedora 8, but not F9

closed-fixed
None
5
2009-03-27
2008-06-27
Anderson Silva
No

g++ -O2 -g -pipe -Wall -Wp,-D_FORTIFY_SOURCE=2 -fexceptions -fstack-protector --param=ssp-buffer-size=4 -m64 -mtune=generic decpcap_test.cpp decpcap.o -o decpcap_test -lpcap -lm
conninode.cpp: In function 'void addtoconninode(char*)':
conninode.cpp:48: error: 'exit' was not declared in this scope
conninode.cpp: In function 'void refreshconninode()':
conninode.cpp:162: error: 'exit' was not declared in this scope
make: *** [conninode.o] Error 1
make: *** Waiting for unfinished jobs....
error: Bad exit status from /var/tmp/rpm-tmp.18203 (%build)

Discussion

  • Anderson Silva
    Anderson Silva
    2008-06-27

    • assigned_to: nobody --> raboofje
     
  • Arnout Engelen
    Arnout Engelen
    2009-03-12

    • status: open --> pending-fixed
     
  • Arnout Engelen
    Arnout Engelen
    2009-03-12

    according to POSIX exit() should be declared in stdlib.h, and that's (now) included in conninode.h, so I'm guessing this problem should now be solved.

     
    • status: pending-fixed --> closed-fixed
     
  • This Tracker item was closed automatically by the system. It was
    previously set to a Pending status, and the original submitter
    did not respond within 14 days (the time period specified by
    the administrator of this Tracker).