#4 Fails to build on Windows

open
nobody
None
5
2005-12-28
2005-12-28
Anonymous
No

building netclasses on Windows results in the following:

NetBase.m: In function `-[NetApplication
receivedEvent:type:extra:forMode:]':
NetBase.m:320: error: `ET_RDESC' undeclared (first use
in this function)
NetBase.m:320: error: (Each undeclared identifier is
reported only once
NetBase.m:320: error: for each function it appears in.)
NetBase.m:330: error: `ET_WDESC' undeclared (first use
in this function)
NetBase.m:338: error: `ET_EDESC' undeclared (first use
in this function)
NetBase.m: In function `-[NetApplication connectObject:]':
NetBase.m:390: error: `ET_EDESC' undeclared (first use
in this function)
NetBase.m:393: error: `ET_RDESC' undeclared (first use
in this function)
NetBase.m: In function `-[NetApplication
disconnectObject:]':
NetBase.m:416: error: `ET_WDESC' undeclared (first use
in this function)
NetBase.m:423: error: `ET_RDESC' undeclared (first use
in this function)
NetBase.m:426: error: `ET_EDESC' undeclared (first use
in this function)
NetBase.m: In function `-[NetApplication
transportNeedsToWrite:]':
NetBase.m:462: error: `ET_WDESC' undeclared (first use
in this function)
make[2]: *** [shared_obj/NetBase.o] Error 1
make[1]: *** [netclasses.all.framework.variables] Error 2
make[1]: Leaving directory
`/home/arsatori/netclasses-1.05/Source'
make: *** [internal-all] Error 2

Discussion