DEBUG=1 make fails for 1.1rc3

Vincent
2005-02-26
2012-10-06
  • Vincent
    Vincent
    2005-02-26

    CC [M] /home/vincentc/ndiswrapper-1.1rc3/driver/wrapper.o
    /home/vincentc/ndiswrapper-1.1rc3/driver/wrapper.c:919:20: macro "DBGTRACE" requires 3 arguments, but only 1 given
    /home/vincentc/ndiswrapper-1.1rc3/driver/wrapper.c: In function ndiswrapper_remove_one_dev': /home/vincentc/ndiswrapper-1.1rc3/driver/wrapper.c:919: error:DBGTRACE' undeclared (first use in this function)
    /home/vincentc/ndiswrapper-1.1rc3/driver/wrapper.c:919: error: (Each undeclared identifier is reported only once
    /home/vincentc/ndiswrapper-1.1rc3/driver/wrapper.c:919: error: for each function it appears in.)
    make[3]: [/home/vincentc/ndiswrapper-1.1rc3/driver/wrapper.o] Error 1
    make[2]:
    [module/home/vincentc/ndiswrapper-1.1rc3/driver] Error 2
    make[2]: Leaving directory /usr/src/linux-2.6.10-r1' make[1]: *** [default] Error 2 make[1]: Leaving directory/home/vincentc/ndiswrapper-1.1rc3/driver'
    make: *** [all] Error 2