Work at SourceForge, help us to make it a better place! We have an immediate need for a Support Technician in our San Francisco or Denver office.

Close

#12 Problem compiling mysqlnavigator 1.4.2

open
nobody
None
5
2010-04-20
2010-04-20
Pierre
No

# make
make all-recursive
make[1]: Entering directory `/tmp/mysqlnavigator-1.4.2'
Making all in include
make[2]: Entering directory `/tmp/mysqlnavigator-1.4.2/include'
rm -rf *.h *.cpp
ln -s ../src/mysql/about/*.h .
ln -s ../src/mysql/edit/*.h .
ln -s ../src/mysql/server/*.h .
ln -s ../src/mysql/log/*.h .
ln -s ../src/mysql/mainwindow/*.h .
ln -s ../src/mysql/query/*.h .
ln -s ../src/mysql/script/*.h .
ln -s ../src/mysql/table/*.h .
ln -s ../src/mysql/schema/*.h .
ln -s ../src/mysql/user/*.h .
ln -s ../src/mysql/flush/*.h .
ln -s ../src/mysql/process/*.h .
ln -s ../src/mysql/xport/*.h .
ln -s ../src/mysql/widget/*.h .
ln -s ../src/mysql/xml/*.h .
ln -s ../src/mysql/field/*.h .
ln -s ../src/mysql/privilege/*.h .
ln -s ../src/mysql/option/*.h .
ln -s ../src/mysql/password/*.h .
ln -s ../src/mysql/style/*.h .
ln -s ../src/mysql/find/*.h .
ln -s ../src/mysql/sql/*.h .
ln -s ../src/mysql/key/*.h .
ln -s ../src/mysql/copy/*.h .
ln -s ../src/main/*.h .
make[2]: Leaving directory `/tmp/mysqlnavigator-1.4.2/include'
Making all in src
make[2]: Entering directory `/tmp/mysqlnavigator-1.4.2/src'
Making all in mysql
make[3]: Entering directory `/tmp/mysqlnavigator-1.4.2/src/mysql'
Making all in about
make[4]: Entering directory `/tmp/mysqlnavigator-1.4.2/src/mysql/about'
if /bin/sh ../../../libtool --mode=compile g++ -DHAVE_CONFIG_H -I. -I. -I../../.. -I../../../pics -I../../../include -I/usr/local/mysql/include/mysql -I/include -O2 -Wall -MT about.lo -MD -MP -MF ".deps/about.Tpo" \ -c -o about.lo `test -f 'about.cxx' || echo './'`about.cxx; \ then mv ".deps/about.Tpo" ".deps/about.Plo"; \ else rm -f ".deps/about.Tpo"; exit 1; \ fi
rm -f .libs/about.lo
g++ -DHAVE_CONFIG_H -I. -I. -I../../.. -I../../../pics -I../../../include -I/usr/local/mysql/include/mysql -I/include -O2 -Wall -MT about.lo -MD -MP -MF .deps/about.Tpo -c about.cxx -fPIC -DPIC -o .libs/about.lo
In file included from about.cxx:9:
about.h:12:22: error: qvariant.h: No such file or directory
about.h:13:21: error: qdialog.h: No such file or directory
about.cxx:11:26: error: qbuttongroup.h: No such file or directory
about.cxx:12:20: error: qlabel.h: No such file or directory
about.cxx:13:25: error: qpushbutton.h: No such file or directory
about.cxx:14:24: error: qtabwidget.h: No such file or directory
about.cxx:15:23: error: qtextview.h: No such file or directory
about.cxx:16:21: error: qwidget.h: No such file or directory
about.cxx:17:21: error: qlayout.h: No such file or directory
about.cxx:19:22: error: qtooltip.h: No such file or directory
about.cxx:20:24: error: qwhatsthis.h: No such file or directory
about.cxx:85:24: warning: missing terminating " character
about.cxx:85: error: missing terminating " character
about.cxx:86: error: stray '\' in program
about.cxx:86: error: stray '\' in program
about.cxx:86: error: stray '\' in program
about.cxx:86: error: stray '\' in program
about.cxx:86:184: warning: character constant too long for its type
about.cxx:86: error: stray '\' in program
about.cxx:86: error: stray '\' in program
about.cxx:86: error: stray '\' in program
about.cxx:86: error: stray '\' in program
about.cxx:86: error: stray '\' in program
about.cxx:86: error: stray '\' in program
about.cxx:86:859: warning: missing terminating ' character
about.cxx:86: error: missing terminating ' character
about.cxx:87: error: stray '\' in program
about.cxx:87: error: stray '\' in program
about.cxx:87: error: stray '\' in program
about.cxx:87:153: warning: missing terminating ' character
about.cxx:87: error: missing terminating ' character
about.cxx:88: error: stray '\' in program
about.cxx:88: error: stray '\' in program
about.cxx:88: error: stray '\' in program
about.cxx:88: error: stray '\' in program
about.cxx:88: error: stray '\' in program
about.cxx:88: error: stray '\' in program
about.cxx:88: error: stray '\' in program
about.cxx:88: error: stray '\' in program
about.cxx:88: error: stray '\' in program
about.cxx:88: error: stray '\' in program
about.cxx:88: error: stray '\' in program
about.cxx:88: error: stray '\' in program
about.cxx:88: error: stray '\' in program
about.cxx:88: error: stray '\' in program
about.cxx:88: error: stray '\' in program
about.cxx:88: error: stray '\' in program
about.cxx:88: error: stray '\' in program
about.cxx:88: error: stray '\' in program
about.cxx:88: error: stray '\' in program
about.cxx:88: error: stray '\' in program
about.cxx:88: error: stray '\' in program
about.cxx:88: error: stray '\' in program
about.cxx:88: error: stray '\' in program
about.cxx:88: error: stray '\' in program
about.cxx:88: error: stray '\' in program
about.cxx:88: error: stray '\' in program
about.cxx:88: error: stray '\' in program
about.cxx:88: error: stray '\' in program
about.cxx:88: error: stray '\' in program
about.cxx:88: error: stray '\' in program
about.cxx:88: error: stray '\' in program
about.cxx:88: error: stray '\' in program
about.cxx:88: error: stray '\' in program
about.cxx:88: error: stray '\' in program
about.cxx:88: error: stray '\' in program
about.cxx:88: error: stray '\' in program
about.cxx:89: error: stray '\' in program
about.cxx:89: error: stray '\' in program
about.cxx:89: error: stray '\' in program
about.cxx:89: error: stray '\' in program
about.cxx:89: error: stray '\' in program
about.cxx:89: error: stray '\' in program
about.cxx:89: error: stray '\' in program
about.cxx:89: error: stray '\' in program
about.cxx:89: error: stray '\' in program
about.cxx:89: error: stray '\' in program
about.cxx:89: error: stray '\' in program
about.cxx:89: error: stray '\' in program
about.cxx:89: error: stray '\' in program
about.cxx:89: error: stray '\' in program
about.cxx:89: error: stray '\' in program
about.cxx:89: error: stray '\' in program
about.cxx:89: error: stray '\' in program
about.cxx:89: error: stray '\' in program
about.cxx:89: error: stray '\' in program
about.cxx:89: error: stray '\' in program
about.cxx:89: error: stray '\' in program
about.cxx:89: error: stray '\' in program
about.cxx:89: error: stray '\' in program
about.cxx:89: error: stray '\' in program
about.cxx:89: error: stray '\' in program
about.cxx:89: error: stray '\' in program
about.cxx:89: error: stray '\' in program
about.cxx:89: error: stray '\' in program
about.cxx:89: error: stray '\' in program
about.cxx:89: error: stray '\' in program
about.cxx:89: error: stray '\' in program
about.cxx:89: error: stray '\' in program
about.cxx:89: error: stray '\' in program
about.cxx:89: error: stray '\' in program
about.cxx:89: error: stray '\' in program
about.cxx:89: error: stray '\' in program
about.cxx:90: error: stray '\' in program
about.cxx:90: error: stray '\' in program
about.cxx:90: error: stray '\' in program
about.cxx:90: error: stray '\' in program
about.cxx:90: error: stray '\' in program
about.cxx:90: error: stray '\' in program
about.cxx:90: error: stray '\' in program
about.cxx:90:396: warning: missing terminating ' character
about.cxx:90: error: missing terminating ' character
about.cxx:91: error: stray '\' in program
about.cxx:91: error: stray '\' in program
about.cxx:91: error: stray '\' in program
about.cxx:91: error: stray '\' in program
about.cxx:91: error: stray '\' in program
about.cxx:91: error: stray '\' in program
about.cxx:91: error: stray '\' in program
about.cxx:91: error: stray '\' in program
about.cxx:91: error: stray '\' in program
about.cxx:91: error: stray '\' in program
about.cxx:91: error: stray '\' in program
about.cxx:91: error: stray '\' in program
about.cxx:91: error: stray '\' in program
about.cxx:91: error: stray '\' in program
about.cxx:91: error: stray '\' in program
about.cxx:91: error: stray '\' in program
about.cxx:91: error: stray '\' in program
about.cxx:91: error: stray '\' in program
about.cxx:91: error: stray '\' in program
about.cxx:91: error: stray '\' in program
about.cxx:91: error: stray '\' in program
about.cxx:91: error: stray '\' in program
about.cxx:91:1154: warning: missing terminating " character
about.cxx:91: error: missing terminating " character
about.cxx:92: error: stray '\' in program
about.cxx:92: error: stray '\' in program
about.cxx:92: error: stray '\' in program
about.cxx:92: error: stray '\' in program
In file included from about.cxx:9:
about.h:25: error: expected class-name before '{' token
about.h:26: error: ISO C++ forbids declaration of 'Q_OBJECT' with no type
about.h:28: error: expected ';' before 'public'
about.h:47: error: expected ':' before 'slots'
about.h:48: error: expected primary-expression before 'void'
about.h:48: error: ISO C++ forbids declaration of 'slots' with no type
about.h:48: error: expected ';' before 'void'
about.cxx:32: error: 'WFlags' has not been declared
about.cxx:32: error: prototype for 'About::About(QWidget*, const char*, bool, int)' does not match any in class 'About'
about.h:25: error: candidates are: About::About(const About&)
about.h:25: error: About::About()
about.cxx:108: error: no 'void About::slot_close()' member function declared in class 'About'
../../../pics/x.xpm:2: warning: 'x_xpm' defined but not used
make[4]: *** [about.lo] Error 1
make[4]: Leaving directory `/tmp/mysqlnavigator-1.4.2/src/mysql/about'
make[3]: *** [all-recursive] Error 1
make[3]: Leaving directory `/tmp/mysqlnavigator-1.4.2/src/mysql'
make[2]: *** [all-recursive] Error 1
make[2]: Leaving directory `/tmp/mysqlnavigator-1.4.2/src'
make[1]: *** [all-recursive] Error 1
make[1]: Leaving directory `/tmp/mysqlnavigator-1.4.2'
make: *** [all] Error 2

Discussion