Work at SourceForge, help us to make it a better place! We have an immediate need for a Support Technician in our San Francisco or Denver office.

Close

#593 MCRMycoreObjectSolrXSLTest fails

svn
open
mcrvuchi
None
1
2013-02-04
2012-12-12
No

under Windows 7, Java 7

-------------------------------------------------------------------------------

Test set: org.mycore.solr.index.test.MCRMycoreObjectSolrXSLTest
-------------------------------------------------------------------------------

Tests run: 3, Failures: 2, Errors: 0, Skipped: 0, Time elapsed: 0.99 sec
<<< FAILURE!
singleTransform(org.mycore.solr.index.test.MCRMycoreObjectSolrXSLTest)
Time elapsed: 101 sec <<< FAILURE!
java.lang.AssertionError: expected:<1> but was:<0>
at org.junit.Assert.fail(Assert.java:91)
at org.junit.Assert.failNotEquals(Assert.java:645)
at org.junit.Assert.assertEquals(Assert.java:126)
at org.junit.Assert.assertEquals(Assert.java:470)
at org.junit.Assert.assertEquals(Assert.java:454)
at
org.mycore.solr.index.test.MCRMycoreObjectSolrXSLTest.singleTransform(MCRMycoreObjectSolrXSLTest.java:47)

at sun.reflect.NativeMethodAccessorImpl.invoke0(Native Method)
at
sun.reflect.NativeMethodAccessorImpl.invoke(NativeMethodAccessorImpl.java:57)

at
sun.reflect.DelegatingMethodAccessorImpl.invoke(DelegatingMethodAccessorImpl.java:43)

at java.lang.reflect.Method.invoke(Method.java:601)
at
org.junit.runners.model.FrameworkMethod$1.runReflectiveCall(FrameworkMethod.java:44)

at
org.junit.internal.runners.model.ReflectiveCallable.run(ReflectiveCallable.java:15)

at
org.junit.runners.model.FrameworkMethod.invokeExplosively(FrameworkMethod.java:41)

at
org.junit.internal.runners.statements.InvokeMethod.evaluate(InvokeMethod.java:20)

at
org.junit.runners.BlockJUnit4ClassRunner.runNotIgnored(BlockJUnit4ClassRunner.java:79)

at
org.junit.runners.BlockJUnit4ClassRunner.runChild(BlockJUnit4ClassRunner.java:71)

at
org.junit.runners.BlockJUnit4ClassRunner.runChild(BlockJUnit4ClassRunner.java:49)

at org.junit.runners.ParentRunner$3.run(ParentRunner.java:193)
at org.junit.runners.ParentRunner$1.schedule(ParentRunner.java:52)
at org.junit.runners.ParentRunner.runChildren(ParentRunner.java:191)
at org.junit.runners.ParentRunner.access$000(ParentRunner.java:42)
at org.junit.runners.ParentRunner$2.evaluate(ParentRunner.java:184)
at org.junit.runners.ParentRunner.run(ParentRunner.java:236)
at
org.apache.maven.surefire.junit4.JUnit4Provider.execute(JUnit4Provider.java:252)

at
org.apache.maven.surefire.junit4.JUnit4Provider.executeTestSet(JUnit4Provider.java:141)

at
org.apache.maven.surefire.junit4.JUnit4Provider.invoke(JUnit4Provider.java:112)

at sun.reflect.NativeMethodAccessorImpl.invoke0(Native Method)
at
sun.reflect.NativeMethodAccessorImpl.invoke(NativeMethodAccessorImpl.java:57)

at
sun.reflect.DelegatingMethodAccessorImpl.invoke(DelegatingMethodAccessorImpl.java:43)

at java.lang.reflect.Method.invoke(Method.java:601)
at
org.apache.maven.surefire.util.ReflectionUtils.invokeMethodWithArray(ReflectionUtils.java:189)

at
org.apache.maven.surefire.booter.ProviderFactory$ProviderProxy.invoke(ProviderFactory.java:165)

at
org.apache.maven.surefire.booter.ProviderFactory.invokeProvider(ProviderFactory.java:85)

at
org.apache.maven.surefire.booter.ForkedBooter.runSuitesInProcess(ForkedBooter.java:115)

at
org.apache.maven.surefire.booter.ForkedBooter.main(ForkedBooter.java:75)

multiTransform(org.mycore.solr.index.test.MCRMycoreObjectSolrXSLTest)
Time elapsed: 14 sec <<< FAILURE!
java.lang.AssertionError: expected:<3> but was:<0>
at org.junit.Assert.fail(Assert.java:91)
at org.junit.Assert.failNotEquals(Assert.java:645)
at org.junit.Assert.assertEquals(Assert.java:126)
at org.junit.Assert.assertEquals(Assert.java:470)
at org.junit.Assert.assertEquals(Assert.java:454)
at
org.mycore.solr.index.test.MCRMycoreObjectSolrXSLTest.multiTransform(MCRMycoreObjectSolrXSLTest.java:69)

at sun.reflect.NativeMethodAccessorImpl.invoke0(Native Method)
at
sun.reflect.NativeMethodAccessorImpl.invoke(NativeMethodAccessorImpl.java:57)

at
sun.reflect.DelegatingMethodAccessorImpl.invoke(DelegatingMethodAccessorImpl.java:43)

at java.lang.reflect.Method.invoke(Method.java:601)
at
org.junit.runners.model.FrameworkMethod$1.runReflectiveCall(FrameworkMethod.java:44)

at
org.junit.internal.runners.model.ReflectiveCallable.run(ReflectiveCallable.java:15)

at
org.junit.runners.model.FrameworkMethod.invokeExplosively(FrameworkMethod.java:41)

at
org.junit.internal.runners.statements.InvokeMethod.evaluate(InvokeMethod.java:20)

at
org.junit.runners.BlockJUnit4ClassRunner.runNotIgnored(BlockJUnit4ClassRunner.java:79)

at
org.junit.runners.BlockJUnit4ClassRunner.runChild(BlockJUnit4ClassRunner.java:71)

at
org.junit.runners.BlockJUnit4ClassRunner.runChild(BlockJUnit4ClassRunner.java:49)

at org.junit.runners.ParentRunner$3.run(ParentRunner.java:193)
at org.junit.runners.ParentRunner$1.schedule(ParentRunner.java:52)
at org.junit.runners.ParentRunner.runChildren(ParentRunner.java:191)
at org.junit.runners.ParentRunner.access$000(ParentRunner.java:42)
at org.junit.runners.ParentRunner$2.evaluate(ParentRunner.java:184)
at org.junit.runners.ParentRunner.run(ParentRunner.java:236)
at
org.apache.maven.surefire.junit4.JUnit4Provider.execute(JUnit4Provider.java:252)

at
org.apache.maven.surefire.junit4.JUnit4Provider.executeTestSet(JUnit4Provider.java:141)

at
org.apache.maven.surefire.junit4.JUnit4Provider.invoke(JUnit4Provider.java:112)

at sun.reflect.NativeMethodAccessorImpl.invoke0(Native Method)
at
sun.reflect.NativeMethodAccessorImpl.invoke(NativeMethodAccessorImpl.java:57)

at
sun.reflect.DelegatingMethodAccessorImpl.invoke(DelegatingMethodAccessorImpl.java:43)

at java.lang.reflect.Method.invoke(Method.java:601)
at
org.apache.maven.surefire.util.ReflectionUtils.invokeMethodWithArray(ReflectionUtils.java:189)

at
org.apache.maven.surefire.booter.ProviderFactory$ProviderProxy.invoke(ProviderFactory.java:165)

at
org.apache.maven.surefire.booter.ProviderFactory.invokeProvider(ProviderFactory.java:85)

at
org.apache.maven.surefire.booter.ForkedBooter.runSuitesInProcess(ForkedBooter.java:115)

at
org.apache.maven.surefire.booter.ForkedBooter.main(ForkedBooter.java:75)

Discussion

  • Silvio
    Silvio
    2013-02-04

    • assigned_to: Silvio --> mcrvuchi
    • milestone: --> svn
    • priority: 5 --> 1