Work at SourceForge, help us to make it a better place! We have an immediate need for a Support Technician in our San Francisco or Denver office.

Close

#180 Cygwin - Errors encountered during "make" (mpg123 v.1.14.4)

0.68
closed-fixed
nobody
mpg123 (103)
5
2013-02-24
2012-11-07
Migs Cabral
No

I'm using Cygwin v.1.7.17 and trying to build mpg123 v1.14.4
I encountered the following errors during make:

Making all in src
make[1]: Entering directory `/cygdrive/C/Users/CCS/Documents/CabralMA/COURSES/COMPRO2/AY201213T2/MP2/mpg123-1.14.4/src'
make all-recursive
make[2]: Entering directory `/cygdrive/C/Users/CCS/Documents/CabralMA/COURSES/COMPRO2/AY201213T2/MP2/mpg123-1.14.4/src'
Making all in output
make[3]: Entering directory `/cygdrive/C/Users/CCS/Documents/CabralMA/COURSES/COMPRO2/AY201213T2/MP2/mpg123-1.14.4/src/output'
make[3]: Nothing to be done for `all'.
make[3]: Leaving directory `/cygdrive/C/Users/CCS/Documents/CabralMA/COURSES/COMPRO2/AY201213T2/MP2/mpg123-1.14.4/src/output'
Making all in libmpg123
make[3]: Entering directory `/cygdrive/C/Users/CCS/Documents/CabralMA/COURSES/COMPRO2/AY201213T2/MP2/mpg123-1.14.4/src/libmpg123'
make[3]: Nothing to be done for `all'.
make[3]: Leaving directory `/cygdrive/C/Users/CCS/Documents/CabralMA/COURSES/COMPRO2/AY201213T2/MP2/mpg123-1.14.4/src/libmpg123'
make[3]: Entering directory `/cygdrive/C/Users/CCS/Documents/CabralMA/COURSES/COMPRO2/AY201213T2/MP2/mpg123-1.14.4/src'
gcc -DHAVE_CONFIG_H -I. -I../src/libmpg123 -I../src/libmpg123 -DPKGLIBDIR="\"/usr/local/lib/mpg123\"" -DOPT_MULTI -DOPT_GENERIC -DOPT_GENERIC_DITHER -DOPT_I386 -DOPT_I586 -DOPT_I586_DITHER -DOPT_MMX -DOPT_3DNOW -DOPT_3DNOWEXT -DOPT_SSE -DREAL_IS_FLOAT -DNEWOLD_WRITE_SAMPLE -O2 -fomit-frame-pointer -funroll-all-loops -finline-functions -ffast-math -g -O2 -MT audio.o -MD -MP -MF .deps/audio.Tpo -c -o audio.o audio.c
audio.c: In function 'init_output':
audio.c:478:26: error: 'SIGUSR1' undeclared (first use in this function)
audio.c:478:26: note: each undeclared identifier is reported only once for each function it appears in
audio.c:479:16: error: 'SIG_BLOCK' undeclared (first use in this function)
audio.c:518:15: error: 'SIG_UNBLOCK' undeclared (first use in this function)
Makefile:579: recipe for target `audio.o' failed
make[3]: *** [audio.o] Error 1
make[3]: Leaving directory `/cygdrive/C/Users/CCS/Documents/CabralMA/COURSES/COMPRO2/AY201213T2/MP2/mpg123-1.14.4/src'
Makefile:711: recipe for target `all-recursive' failed
make[2]: *** [all-recursive] Error 1
make[2]: Leaving directory `/cygdrive/C/Users/CCS/Documents/CabralMA/COURSES/COMPRO2/AY201213T2/MP2/mpg123-1.14.4/src'
Makefile:428: recipe for target `all' failed
make[1]: *** [all] Error 2
make[1]: Leaving directory `/cygdrive/C/Users/CCS/Documents/CabralMA/COURSES/COMPRO2/AY201213T2/MP2/mpg123-1.14.4/src'
Makefile:584: recipe for target `all-recursive' failed
make: *** [all-recursive] Error 1

Discussion

  • Jonathan Yong
    Jonathan Yong
    2012-11-08

    Hi,

    I could not reproduce it for 1.7.16, granted it is a version behind. Can you post your config,log?

     
  • Thomas Orgis
    Thomas Orgis
    2013-02-24

    • status: open --> closed-fixed
    • milestone: --> 0.68