#5 Does not compile on current kernels

open
nobody
None
5
2008-06-22
2008-06-22
Anonymous
No

mythtv@mythbackend:~/Downloads/mythtv/lirc_mod_mce> make
make -C /lib/modules/2.6.25.5-1.1-default/build SUBDIRS=/home/mythtv/Downloads/mythtv/lirc_mod_mce modules
make[1]: Entering directory `/usr/src/linux-2.6.25.5-1.1-obj/x86_64/default'
make -C /usr/src/linux-2.6.25.5-1.1 O=/usr/src/linux-2.6.25.5-1.1-obj/x86_64/default/. modules
CC [M] /home/mythtv/Downloads/mythtv/lirc_mod_mce/lirc_mod_mce.o
/home/mythtv/Downloads/mythtv/lirc_mod_mce/lirc_mod_mce.c: In function ‘usb_remote_probe’:
/home/mythtv/Downloads/mythtv/lirc_mod_mce/lirc_mod_mce.c:1301: error: ‘struct input_dev’ has no member named ‘cdev’
make[4]: *** [/home/mythtv/Downloads/mythtv/lirc_mod_mce/lirc_mod_mce.o] Error 1
make[3]: *** [_module_/home/mythtv/Downloads/mythtv/lirc_mod_mce] Error 2
make[2]: *** [sub-make] Error 2
make[1]: *** [all] Error 2
make[1]: Leaving directory `/usr/src/linux-2.6.25.5-1.1-obj/x86_64/default'
make: *** [default] Error 2
mythtv@mythbackend:~/Downloads/mythtv/lirc_mod_mce> uname -a
Linux mythbackend 2.6.25.5-1.1-default #1 SMP 2008-06-07 01:55:22 +0200 x86_64 x86_64 x86_64 GNU/Linux

Discussion