Reporting this error as requested after running make check:

 

For mhash ver 0.9.9.9 on RedHat Linux ver 6.2:

 

 

Got this (partial) result for make check:

MD5 HMAC-Test: Ok

PASS: hmac_test

/bin/sh: line 4:  3681 Segmentation fault      (core dumped) ${dir}$tst

FAIL: keygen_test

...

============================================

1 of 5 tests failed

Please report to mhash-devel@sourceforge.net

============================================

make[2]: *** [check-TESTS] Error 1

make[2]: Leaving directory `/home/foxmi/mhash-0.9.9.9/src'

make[1]: *** [check-am] Error 2

make[1]: Leaving directory `/home/foxmi/mhash-0.9.9.9/src'

make: *** [check-recursive] Error 1

 

Please let me know if you'd like more information and if you have a solution.

 

Thanks,

Mike