#6 mkclean 0.8.3: OSX

open
Steve Lhomme
mkclean (4)
5
2014-08-25
2011-06-10
MooCan
No

Hello,

I'm trying to build mkclean 0.8.3 on OSX SL 10.6.7 and here is my error:

compiling ../corec/corec/array/array.c
In file included from ../corec/corec/corec.h:43,
from ../corec/corec/array/array.h:33,
from ../corec/corec/array/array.c:30:
../corec/corec/portab.h:38:20: warning: string.h: No such file or directory
../corec/corec/portab.h:39:19: warning: ctype.h: No such file or directory
In file included from /usr/llvm-gcc-4.2/bin/../lib/gcc/i686-apple-darwin10/4.2.1/include/limits.h:15,
from ../corec/corec/portab.h:42,
from ../corec/corec/corec.h:43,
from ../corec/corec/array/array.h:33,
from ../corec/corec/array/array.c:30:
/Developer/usr/llvm-gcc-4.2/lib/gcc/i686-apple-darwin10/4.2.1/include/limits.h:15:25: error: no include path in which to search for limits.h
In file included from ../corec/corec/corec.h:43,
from ../corec/corec/array/array.h:33,
from ../corec/corec/array/array.c:30:
../corec/corec/portab.h:127:109: warning: TargetConditionals.h: No such file or directory
../corec/corec/portab.h:314:20: warning: stdlib.h: No such file or directory
../corec/corec/portab.h:339:22: warning: inttypes.h: No such file or directory
In file included from ../corec/corec/corec.h:43,
from ../corec/corec/array/array.h:33,
from ../corec/corec/array/array.c:30:
../corec/corec/portab.h:347: error: expected ‘=’, ‘,’, ‘;’, ‘asm’ or ‘__attribute__’ before ‘int_fast32_t’
../corec/corec/portab.h:348: error: expected ‘=’, ‘,’, ‘;’, ‘asm’ or ‘__attribute__’ before ‘uint_fast32_t’
../corec/corec/portab.h:355: error: expected ‘=’, ‘,’, ‘;’, ‘asm’ or ‘__attribute__’ before ‘int_fast8_t’
../corec/corec/portab.h:356: error: expected ‘=’, ‘,’, ‘;’, ‘asm’ or ‘__attribute__’ before ‘uint_fast8_t’
../corec/corec/portab.h:357: error: expected ‘=’, ‘,’, ‘;’, ‘asm’ or ‘__attribute__’ before ‘int_fast64_t’
../corec/corec/portab.h:358: error: expected ‘=’, ‘,’, ‘;’, ‘asm’ or ‘__attribute__’ before ‘uint_fast64_t’
../corec/corec/portab.h:404: error: expected ‘=’, ‘,’, ‘;’, ‘asm’ or ‘__attribute__’ before ‘int64_t’
../corec/corec/portab.h:405: error: expected ‘=’, ‘,’, ‘;’, ‘asm’ or ‘__attribute__’ before ‘uint64_t’
../corec/corec/portab.h:408: error: expected ‘=’, ‘,’, ‘;’, ‘asm’ or ‘__attribute__’ before ‘int_fast32_t’
../corec/corec/portab.h:409: error: expected ‘=’, ‘,’, ‘;’, ‘asm’ or ‘__attribute__’ before ‘uint_fast32_t’
../corec/corec/portab.h:410: error: expected ‘=’, ‘,’, ‘;’, ‘asm’ or ‘__attribute__’ before ‘int_fast16_t’
../corec/corec/portab.h:411: error: expected ‘=’, ‘,’, ‘;’, ‘asm’ or ‘__attribute__’ before ‘uint_fast16_t’
../corec/corec/portab.h:414: error: expected ‘=’, ‘,’, ‘;’, ‘asm’ or ‘__attribute__’ before ‘int_fast64_t’
../corec/corec/portab.h:415: error: expected ‘=’, ‘,’, ‘;’, ‘asm’ or ‘__attribute__’ before ‘uint_fast64_t’
../corec/corec/portab.h:465: error: expected ‘=’, ‘,’, ‘;’, ‘asm’ or ‘__attribute__’ before ‘err_t’
../corec/corec/portab.h:466: error: expected ‘=’, ‘,’, ‘;’, ‘asm’ or ‘__attribute__’ before ‘bool_t’
../corec/corec/portab.h:467: error: expected ‘=’, ‘,’, ‘;’, ‘asm’ or ‘__attribute__’ before ‘tick_t’
../corec/corec/portab.h:482: error: expected specifier-qualifier-list before ‘int_fast32_t’
../corec/corec/portab.h:488: error: expected specifier-qualifier-list before ‘int_fast64_t’
In file included from ../corec/corec/corec.h:43,
from ../corec/corec/array/array.h:33,
from ../corec/corec/array/array.c:30:
../corec/corec/portab.h:755: error: expected ‘=’, ‘,’, ‘;’, ‘asm’ or ‘__attribute__’ before ‘filepos_t’
In file included from ../corec/corec/corec.h:46,
from ../corec/corec/array/array.h:33,
from ../corec/corec/array/array.c:30:
../corec/corec/helper.h:234: error: expected ‘=’, ‘,’, ‘;’, ‘asm’ or ‘__attribute__’ before ‘Scale64’
../corec/corec/helper.h:241: error: expected ‘)’ before ‘v’
../corec/corec/helper.h: In function ‘Fix16Mul’:
../corec/corec/helper.h:256: error: ‘int64_t’ undeclared (first use in this function)
../corec/corec/helper.h:256: error: (Each undeclared identifier is reported only once
../corec/corec/helper.h:256: error: for each function it appears in.)
In file included from ../corec/corec/array/array.c:30:
../corec/corec/array/array.h: At top level:
../corec/corec/array/array.h:49: error: expected ‘=’, ‘,’, ‘;’, ‘asm’ or ‘__attribute__’ before ‘Data_ReAlloc’
../corec/corec/array/array.h:53: error: expected ‘=’, ‘,’, ‘;’, ‘asm’ or ‘__attribute__’ before ‘Data_Set’
../corec/corec/array/array.h:72: error: expected ‘=’, ‘,’, ‘;’, ‘asm’ or ‘__attribute__’ before ‘ArrayEq’
../corec/corec/array/array.h:73: error: expected ‘=’, ‘,’, ‘;’, ‘asm’ or ‘__attribute__’ before ‘ArrayCopy’
../corec/corec/array/array.h:74: error: expected ‘=’, ‘,’, ‘;’, ‘asm’ or ‘__attribute__’ before ‘ArrayResize’
../corec/corec/array/array.h:76: error: expected ‘=’, ‘,’, ‘;’, ‘asm’ or ‘__attribute__’ before ‘ArrayFindEx’
../corec/corec/array/array.h:77: error: expected ‘=’, ‘,’, ‘;’, ‘asm’ or ‘__attribute__’ before ‘ArrayAlloc’
../corec/corec/array/array.h:78: error: expected ‘=’, ‘,’, ‘;’, ‘asm’ or ‘__attribute__’ before ‘ArrayAppend’
../corec/corec/array/array.h:79: error: expected ‘=’, ‘,’, ‘;’, ‘asm’ or ‘__attribute__’ before ‘ArrayAppendStr’
../corec/corec/array/array.h:81: error: expected ‘=’, ‘,’, ‘;’, ‘asm’ or ‘__attribute__’ before ‘ArrayAddEx’
../corec/corec/array/array.h:82: error: expected ‘=’, ‘,’, ‘;’, ‘asm’ or ‘__attribute__’ before ‘ArrayRemoveEx’
../corec/corec/array/array.h:83: error: expected declaration specifiers or ‘...’ before ‘bool_t’
../corec/corec/array/array.h:84: error: expected ‘=’, ‘,’, ‘;’, ‘asm’ or ‘__attribute__’ before ‘ArrayInsert’
../corec/corec/array/array.h:108: error: expected specifier-qualifier-list before ‘uintptr_t’
../corec/corec/array/array.h:151: error: expected ‘=’, ‘,’, ‘;’, ‘asm’ or ‘__attribute__’ before ‘Fifo_Alloc’
../corec/corec/array/array.c:50: error: expected ‘=’, ‘,’, ‘;’, ‘asm’ or ‘__attribute__’ before ‘Data_ReAlloc’
../corec/corec/array/array.c: In function ‘Data_Release’:
../corec/corec/array/array.c:118: warning: implicit declaration of function ‘free’
../corec/corec/array/array.c: At top level:
../corec/corec/array/array.c:136: error: expected ‘=’, ‘,’, ‘;’, ‘asm’ or ‘__attribute__’ before ‘Data_Set’
../corec/corec/array/array.c:178: error: expected ‘=’, ‘,’, ‘;’, ‘asm’ or ‘__attribute__’ before ‘ArrayAlloc’
../corec/corec/array/array.c:194: error: expected ‘=’, ‘,’, ‘;’, ‘asm’ or ‘__attribute__’ before ‘ArrayInsert’
../corec/corec/array/array.c: In function ‘ArrayDelete’:
../corec/corec/array/array.c:206: warning: implicit declaration of function ‘memmove’
../corec/corec/array/array.c:206: warning: incompatible implicit declaration of built-in function ‘memmove’
../corec/corec/array/array.c: At top level:
../corec/corec/array/array.c:210: error: expected ‘=’, ‘,’, ‘;’, ‘asm’ or ‘__attribute__’ before ‘ArrayAppendStr’
../corec/corec/array/array.c:222: error: expected ‘=’, ‘,’, ‘;’, ‘asm’ or ‘__attribute__’ before ‘ArrayAppend’
../corec/corec/array/array.c:233: error: expected ‘=’, ‘,’, ‘;’, ‘asm’ or ‘__attribute__’ before ‘ArrayEq’
../corec/corec/array/array.c:240: error: expected ‘=’, ‘,’, ‘;’, ‘asm’ or ‘__attribute__’ before ‘ArrayCopy’
../corec/corec/array/array.c:249: error: expected ‘=’, ‘,’, ‘;’, ‘asm’ or ‘__attribute__’ before ‘ArrayResize’
../corec/corec/array/array.c: In function ‘ArrayZero’:
../corec/corec/array/array.c:259: warning: implicit declaration of function ‘memset’
../corec/corec/array/array.c:259: warning: incompatible implicit declaration of built-in function ‘memset’
../corec/corec/array/array.c: At top level:
../corec/corec/array/array.c:264: error: expected ‘)’ before ‘*’ token
../corec/corec/array/array.c:271: error: expected ‘)’ before ‘*’ token
../corec/corec/array/array.c:341: error: expected declaration specifiers or ‘...’ before ‘bool_t’
../corec/corec/array/array.c: In function ‘ArraySortEx’:
../corec/corec/array/array.c:348: error: ‘uint_fast32_t’ undeclared (first use in this function)
../corec/corec/array/array.c:350: error: ‘End’ undeclared (first use in this function)
../corec/corec/array/array.c:350: error: expected expression before ‘)’ token
../corec/corec/array/array.c:351: error: ‘i’ undeclared (first use in this function)
../corec/corec/array/array.c:352: error: ‘j’ undeclared (first use in this function)
../corec/corec/array/array.c:354: warning: implicit declaration of function ‘InQSort’
../corec/corec/array/array.c:354: error: expected expression before ‘)’ token
../corec/corec/array/array.c:356: error: expected expression before ‘)’ token
../corec/corec/array/array.c:361: error: expected ‘;’ before ‘Tmp’
../corec/corec/array/array.c:365: error: expected expression before ‘)’ token
../corec/corec/array/array.c:368: error: ‘Tmp’ undeclared (first use in this function)
../corec/corec/array/array.c:374: error: ‘Unique’ undeclared (first use in this function)
../corec/corec/array/array.c:376: error: expected expression before ‘)’ token
../corec/corec/array/array.c:399: warning: implicit declaration of function ‘memcpy’
../corec/corec/array/array.c:399: warning: incompatible implicit declaration of built-in function ‘memcpy’
../corec/corec/array/array.c:424: warning: incompatible implicit declaration of built-in function ‘memcpy’
../corec/corec/array/array.c: At top level:
../corec/corec/array/array.c:434: error: expected ‘=’, ‘,’, ‘;’, ‘asm’ or ‘__attribute__’ before ‘ArrayFindEx’
../corec/corec/array/array.c:494: error: expected ‘=’, ‘,’, ‘;’, ‘asm’ or ‘__attribute__’ before ‘ArrayAddEx’
../corec/corec/array/array.c:511: error: expected ‘=’, ‘,’, ‘;’, ‘asm’ or ‘__attribute__’ before ‘ArrayRemoveEx’
../corec/corec/array/array.c: In function ‘ArrayRandomize’:
../corec/corec/array/array.c:533: warning: incompatible implicit declaration of built-in function ‘memcpy’
../corec/corec/array/array.c: At top level:
../corec/corec/array/array.c:581: error: expected ‘=’, ‘,’, ‘;’, ‘asm’ or ‘__attribute__’ before ‘Fifo_Alloc’
../corec/corec/array/array.c: In function ‘Fifo_Write’:
../corec/corec/array/array.c:605: warning: incompatible implicit declaration of built-in function ‘memmove’
../corec/corec/array/array.c:614: warning: implicit declaration of function ‘ArrayAlloc’
../corec/corec/array/array.c:623: warning: incompatible implicit declaration of built-in function ‘memcpy’
make[3]: *** [../build/gcc_osx_x64/corec/corec/array/array.ebml2.o] Error 1
make[2]: *** [../release/gcc_osx_x64/libebml2.a] Error 2
make[1]: *** [../release/gcc_osx_x64/libmatroska2.a] Error 2
make: *** [mkclean] Error 2

Is there any pre-built binaries somewhere ?

Kind regards

Discussion

  • Steve Lhomme
    Steve Lhomme
    2011-07-09

    Unfortunately I don't have access to a Mac nor a virtual machine to work on this.
    Is there are place online where there are OS X shell accessible to fix issues like that ?

     
  • MooCan
    MooCan
    2011-07-13

    Hi,

    Many thanks for your answer.
    I have find a little workaround at homebrew OSX port manager for mkclean 0.8.2:
    and replicated this with 0.8.3 but ....

    https://github.com/mxcl/homebrew/blob/master/Library/Formula/mkclean.rb

    # For 64-bit kernels, just use the Snow Leopard SDK.
    inreplace "corec/tools/coremake/gcc_osx_x64.build" do |s|
    s.gsub! /10\.4u?/, "10.6"
    end

    So i have replace in corec/tools/coremake/gcc_osx_x64.build
    SDK = /Developer/SDKs/MacOSX10.4u.sdk with
    SDK = /Developer/SDKs/MacOSX10.6.sdk

    then run ... ./configure and after make -C mkclean and wait.
    I have some error and warning but it seems to be done (log included after)

    I have as result these files under ./release/gcc_osx_x64/
    -rw-r--r-- 1 root staff 73296 14 jul 00:43 libbzlib.a
    -rw-r--r-- 1 root staff 256488 14 jul 00:43 libebml2.a
    -rw-r--r-- 1 root staff 180616 14 jul 00:43 libmatroska2.a
    -rw-r--r-- 1 root staff 8848 14 jul 00:43 libminilzo.a
    -rw-r--r-- 1 root staff 105864 14 jul 00:43 libtremor.a
    -rwxr-xr-x 1 root staff 494388 14 jul 00:46 mkWDclean
    -rwxr-xr-x 1 root staff 494388 14 jul 00:46 mkclean
    -rwxr-xr-x 1 root staff 148408 14 jul 00:46 mkcleanreg

    I have tried to do a "make install" and I have a new file which appears but nothing is installed (i think binaries in /usr/local/bin and lib in /usr/local/lib):
    -rwxr-xr-x 1 root staff 364908 14 jul 00:49 mkvtree
    I have some warnings here too (included after too)

    I will try to provide you an OSX shell if you want.
    It seems to work but I don't relly know if it's work as expected.

    Kind Regards

    >>>> building log <<<<<<<<<<<<<<<<<<<<<<
    x6dev:mkclean-0.8.3 suroot$ sudo make -C mkclean
    compiling ../corec/corec/array/array.c
    In file included from ../corec/corec/corec.h:43,
    from ../corec/corec/array/array.h:33,
    from ../corec/corec/array/array.c:30:
    ../corec/corec/portab.h:38:20: warning: string.h: No such file or directory
    ../corec/corec/portab.h:39:19: warning: ctype.h: No such file or directory
    In file included from /usr/llvm-gcc-4.2/bin/../lib/gcc/i686-apple-darwin10/4.2.1/include/limits.h:15,
    from ../corec/corec/portab.h:42,
    from ../corec/corec/corec.h:43,
    from ../corec/corec/array/array.h:33,
    from ../corec/corec/array/array.c:30:
    /Developer/usr/llvm-gcc-4.2/lib/gcc/i686-apple-darwin10/4.2.1/include/limits.h:15:25: error: no include path in which to search for limits.h
    In file included from ../corec/corec/corec.h:43,
    from ../corec/corec/array/array.h:33,
    from ../corec/corec/array/array.c:30:
    ../corec/corec/portab.h:127:109: warning: TargetConditionals.h: No such file or directory
    ../corec/corec/portab.h:314:20: warning: stdlib.h: No such file or directory
    ../corec/corec/portab.h:339:22: warning: inttypes.h: No such file or directory
    In file included from ../corec/corec/corec.h:43,
    from ../corec/corec/array/array.h:33,
    from ../corec/corec/array/array.c:30:
    ../corec/corec/portab.h:347: error: expected ‘=’, ‘,’, ‘;’, ‘asm’ or ‘__attribute__’ before ‘int_fast32_t’
    ../corec/corec/portab.h:348: error: expected ‘=’, ‘,’, ‘;’, ‘asm’ or ‘__attribute__’ before ‘uint_fast32_t’
    ../corec/corec/portab.h:355: error: expected ‘=’, ‘,’, ‘;’, ‘asm’ or ‘__attribute__’ before ‘int_fast8_t’
    ../corec/corec/portab.h:356: error: expected ‘=’, ‘,’, ‘;’, ‘asm’ or ‘__attribute__’ before ‘uint_fast8_t’
    ../corec/corec/portab.h:357: error: expected ‘=’, ‘,’, ‘;’, ‘asm’ or ‘__attribute__’ before ‘int_fast64_t’
    ../corec/corec/portab.h:358: error: expected ‘=’, ‘,’, ‘;’, ‘asm’ or ‘__attribute__’ before ‘uint_fast64_t’
    ../corec/corec/portab.h:404: error: expected ‘=’, ‘,’, ‘;’, ‘asm’ or ‘__attribute__’ before ‘int64_t’
    ../corec/corec/portab.h:405: error: expected ‘=’, ‘,’, ‘;’, ‘asm’ or ‘__attribute__’ before ‘uint64_t’
    ../corec/corec/portab.h:408: error: expected ‘=’, ‘,’, ‘;’, ‘asm’ or ‘__attribute__’ before ‘int_fast32_t’
    ../corec/corec/portab.h:409: error: expected ‘=’, ‘,’, ‘;’, ‘asm’ or ‘__attribute__’ before ‘uint_fast32_t’
    ../corec/corec/portab.h:410: error: expected ‘=’, ‘,’, ‘;’, ‘asm’ or ‘__attribute__’ before ‘int_fast16_t’
    ../corec/corec/portab.h:411: error: expected ‘=’, ‘,’, ‘;’, ‘asm’ or ‘__attribute__’ before ‘uint_fast16_t’
    ../corec/corec/portab.h:414: error: expected ‘=’, ‘,’, ‘;’, ‘asm’ or ‘__attribute__’ before ‘int_fast64_t’
    ../corec/corec/portab.h:415: error: expected ‘=’, ‘,’, ‘;’, ‘asm’ or ‘__attribute__’ before ‘uint_fast64_t’
    ../corec/corec/portab.h:465: error: expected ‘=’, ‘,’, ‘;’, ‘asm’ or ‘__attribute__’ before ‘err_t’
    ../corec/corec/portab.h:466: error: expected ‘=’, ‘,’, ‘;’, ‘asm’ or ‘__attribute__’ before ‘bool_t’
    ../corec/corec/portab.h:467: error: expected ‘=’, ‘,’, ‘;’, ‘asm’ or ‘__attribute__’ before ‘tick_t’
    ../corec/corec/portab.h:482: error: expected specifier-qualifier-list before ‘int_fast32_t’
    ../corec/corec/portab.h:488: error: expected specifier-qualifier-list before ‘int_fast64_t’
    In file included from ../corec/corec/corec.h:43,
    from ../corec/corec/array/array.h:33,
    from ../corec/corec/array/array.c:30:
    ../corec/corec/portab.h:755: error: expected ‘=’, ‘,’, ‘;’, ‘asm’ or ‘__attribute__’ before ‘filepos_t’
    In file included from ../corec/corec/corec.h:46,
    from ../corec/corec/array/array.h:33,
    from ../corec/corec/array/array.c:30:
    ../corec/corec/helper.h:234: error: expected ‘=’, ‘,’, ‘;’, ‘asm’ or ‘__attribute__’ before ‘Scale64’
    ../corec/corec/helper.h:241: error: expected ‘)’ before ‘v’
    ../corec/corec/helper.h: In function ‘Fix16Mul’:
    ../corec/corec/helper.h:256: error: ‘int64_t’ undeclared (first use in this function)
    ../corec/corec/helper.h:256: error: (Each undeclared identifier is reported only once
    ../corec/corec/helper.h:256: error: for each function it appears in.)
    In file included from ../corec/corec/array/array.c:30:
    ../corec/corec/array/array.h: At top level:
    ../corec/corec/array/array.h:49: error: expected ‘=’, ‘,’, ‘;’, ‘asm’ or ‘__attribute__’ before ‘Data_ReAlloc’
    ../corec/corec/array/array.h:53: error: expected ‘=’, ‘,’, ‘;’, ‘asm’ or ‘__attribute__’ before ‘Data_Set’
    ../corec/corec/array/array.h:72: error: expected ‘=’, ‘,’, ‘;’, ‘asm’ or ‘__attribute__’ before ‘ArrayEq’
    ../corec/corec/array/array.h:73: error: expected ‘=’, ‘,’, ‘;’, ‘asm’ or ‘__attribute__’ before ‘ArrayCopy’
    ../corec/corec/array/array.h:74: error: expected ‘=’, ‘,’, ‘;’, ‘asm’ or ‘__attribute__’ before ‘ArrayResize’
    ../corec/corec/array/array.h:76: error: expected ‘=’, ‘,’, ‘;’, ‘asm’ or ‘__attribute__’ before ‘ArrayFindEx’
    ../corec/corec/array/array.h:77: error: expected ‘=’, ‘,’, ‘;’, ‘asm’ or ‘__attribute__’ before ‘ArrayAlloc’
    ../corec/corec/array/array.h:78: error: expected ‘=’, ‘,’, ‘;’, ‘asm’ or ‘__attribute__’ before ‘ArrayAppend’
    ../corec/corec/array/array.h:79: error: expected ‘=’, ‘,’, ‘;’, ‘asm’ or ‘__attribute__’ before ‘ArrayAppendStr’
    ../corec/corec/array/array.h:81: error: expected ‘=’, ‘,’, ‘;’, ‘asm’ or ‘__attribute__’ before ‘ArrayAddEx’
    ../corec/corec/array/array.h:82: error: expected ‘=’, ‘,’, ‘;’, ‘asm’ or ‘__attribute__’ before ‘ArrayRemoveEx’
    ../corec/corec/array/array.h:83: error: expected declaration specifiers or ‘...’ before ‘bool_t’
    ../corec/corec/array/array.h:84: error: expected ‘=’, ‘,’, ‘;’, ‘asm’ or ‘__attribute__’ before ‘ArrayInsert’
    ../corec/corec/array/array.h:108: error: expected specifier-qualifier-list before ‘uintptr_t’
    ../corec/corec/array/array.h:151: error: expected ‘=’, ‘,’, ‘;’, ‘asm’ or ‘__attribute__’ before ‘Fifo_Alloc’
    ../corec/corec/array/array.c:50: error: expected ‘=’, ‘,’, ‘;’, ‘asm’ or ‘__attribute__’ before ‘Data_ReAlloc’
    ../corec/corec/array/array.c: In function ‘Data_Release’:
    ../corec/corec/array/array.c:118: warning: implicit declaration of function ‘free’
    ../corec/corec/array/array.c: At top level:
    ../corec/corec/array/array.c:136: error: expected ‘=’, ‘,’, ‘;’, ‘asm’ or ‘__attribute__’ before ‘Data_Set’
    ../corec/corec/array/array.c:178: error: expected ‘=’, ‘,’, ‘;’, ‘asm’ or ‘__attribute__’ before ‘ArrayAlloc’
    ../corec/corec/array/array.c:194: error: expected ‘=’, ‘,’, ‘;’, ‘asm’ or ‘__attribute__’ before ‘ArrayInsert’
    ../corec/corec/array/array.c: In function ‘ArrayDelete’:
    ../corec/corec/array/array.c:206: warning: implicit declaration of function ‘memmove’
    ../corec/corec/array/array.c:206: warning: incompatible implicit declaration of built-in function ‘memmove’
    ../corec/corec/array/array.c: At top level:
    ../corec/corec/array/array.c:210: error: expected ‘=’, ‘,’, ‘;’, ‘asm’ or ‘__attribute__’ before ‘ArrayAppendStr’
    ../corec/corec/array/array.c:222: error: expected ‘=’, ‘,’, ‘;’, ‘asm’ or ‘__attribute__’ before ‘ArrayAppend’
    ../corec/corec/array/array.c:233: error: expected ‘=’, ‘,’, ‘;’, ‘asm’ or ‘__attribute__’ before ‘ArrayEq’
    ../corec/corec/array/array.c:240: error: expected ‘=’, ‘,’, ‘;’, ‘asm’ or ‘__attribute__’ before ‘ArrayCopy’
    ../corec/corec/array/array.c:249: error: expected ‘=’, ‘,’, ‘;’, ‘asm’ or ‘__attribute__’ before ‘ArrayResize’
    ../corec/corec/array/array.c: In function ‘ArrayZero’:
    ../corec/corec/array/array.c:259: warning: implicit declaration of function ‘memset’
    ../corec/corec/array/array.c:259: warning: incompatible implicit declaration of built-in function ‘memset’
    ../corec/corec/array/array.c: At top level:
    ../corec/corec/array/array.c:264: error: expected ‘)’ before ‘*’ token
    ../corec/corec/array/array.c:271: error: expected ‘)’ before ‘*’ token
    ../corec/corec/array/array.c:341: error: expected declaration specifiers or ‘...’ before ‘bool_t’
    ../corec/corec/array/array.c: In function ‘ArraySortEx’:
    ../corec/corec/array/array.c:348: error: ‘uint_fast32_t’ undeclared (first use in this function)
    ../corec/corec/array/array.c:350: error: ‘End’ undeclared (first use in this function)
    ../corec/corec/array/array.c:350: error: expected expression before ‘)’ token
    ../corec/corec/array/array.c:351: error: ‘i’ undeclared (first use in this function)
    ../corec/corec/array/array.c:352: error: ‘j’ undeclared (first use in this function)
    ../corec/corec/array/array.c:354: warning: implicit declaration of function ‘InQSort’
    ../corec/corec/array/array.c:354: error: expected expression before ‘)’ token
    ../corec/corec/array/array.c:356: error: expected expression before ‘)’ token
    ../corec/corec/array/array.c:361: error: expected ‘;’ before ‘Tmp’
    ../corec/corec/array/array.c:365: error: expected expression before ‘)’ token
    ../corec/corec/array/array.c:368: error: ‘Tmp’ undeclared (first use in this function)
    ../corec/corec/array/array.c:374: error: ‘Unique’ undeclared (first use in this function)
    ../corec/corec/array/array.c:376: error: expected expression before ‘)’ token
    ../corec/corec/array/array.c:399: warning: implicit declaration of function ‘memcpy’
    ../corec/corec/array/array.c:399: warning: incompatible implicit declaration of built-in function ‘memcpy’
    ../corec/corec/array/array.c:424: warning: incompatible implicit declaration of built-in function ‘memcpy’
    ../corec/corec/array/array.c: At top level:
    ../corec/corec/array/array.c:434: error: expected ‘=’, ‘,’, ‘;’, ‘asm’ or ‘__attribute__’ before ‘ArrayFindEx’
    ../corec/corec/array/array.c:494: error: expected ‘=’, ‘,’, ‘;’, ‘asm’ or ‘__attribute__’ before ‘ArrayAddEx’
    ../corec/corec/array/array.c:511: error: expected ‘=’, ‘,’, ‘;’, ‘asm’ or ‘__attribute__’ before ‘ArrayRemoveEx’
    ../corec/corec/array/array.c: In function ‘ArrayRandomize’:
    ../corec/corec/array/array.c:533: warning: incompatible implicit declaration of built-in function ‘memcpy’
    ../corec/corec/array/array.c: At top level:
    ../corec/corec/array/array.c:581: error: expected ‘=’, ‘,’, ‘;’, ‘asm’ or ‘__attribute__’ before ‘Fifo_Alloc’
    ../corec/corec/array/array.c: In function ‘Fifo_Write’:
    ../corec/corec/array/array.c:605: warning: incompatible implicit declaration of built-in function ‘memmove’
    ../corec/corec/array/array.c:614: warning: implicit declaration of function ‘ArrayAlloc’
    ../corec/corec/array/array.c:623: warning: incompatible implicit declaration of built-in function ‘memcpy’
    make[3]: *** [../build/gcc_osx_x64/corec/corec/array/array.ebml2.o] Error 1
    make[2]: *** [../release/gcc_osx_x64/libebml2.a] Error 2
    make[1]: *** [../release/gcc_osx_x64/libmatroska2.a] Error 2
    make: *** [mkclean] Error 2
    x6dev:mkclean-0.8.3 suroot$ sudo make -C mkclean
    compiling ../corec/corec/array/array.c
    In file included from ../corec/corec/corec.h:43,
    from ../corec/corec/array/array.h:33,
    from ../corec/corec/array/array.c:30:
    ../corec/corec/portab.h:38:20: warning: string.h: No such file or directory
    ../corec/corec/portab.h:39:19: warning: ctype.h: No such file or directory
    In file included from /usr/llvm-gcc-4.2/bin/../lib/gcc/i686-apple-darwin10/4.2.1/include/limits.h:15,
    from ../corec/corec/portab.h:42,
    from ../corec/corec/corec.h:43,
    from ../corec/corec/array/array.h:33,
    from ../corec/corec/array/array.c:30:
    /Developer/usr/llvm-gcc-4.2/lib/gcc/i686-apple-darwin10/4.2.1/include/limits.h:15:25: error: no include path in which to search for limits.h
    In file included from ../corec/corec/corec.h:43,
    from ../corec/corec/array/array.h:33,
    from ../corec/corec/array/array.c:30:
    ../corec/corec/portab.h:127:109: warning: TargetConditionals.h: No such file or directory
    ../corec/corec/portab.h:314:20: warning: stdlib.h: No such file or directory
    ../corec/corec/portab.h:339:22: warning: inttypes.h: No such file or directory
    In file included from ../corec/corec/corec.h:43,
    from ../corec/corec/array/array.h:33,
    from ../corec/corec/array/array.c:30:
    ../corec/corec/portab.h:347: error: expected ‘=’, ‘,’, ‘;’, ‘asm’ or ‘__attribute__’ before ‘int_fast32_t’
    ../corec/corec/portab.h:348: error: expected ‘=’, ‘,’, ‘;’, ‘asm’ or ‘__attribute__’ before ‘uint_fast32_t’
    ../corec/corec/portab.h:355: error: expected ‘=’, ‘,’, ‘;’, ‘asm’ or ‘__attribute__’ before ‘int_fast8_t’
    ../corec/corec/portab.h:356: error: expected ‘=’, ‘,’, ‘;’, ‘asm’ or ‘__attribute__’ before ‘uint_fast8_t’
    ../corec/corec/portab.h:357: error: expected ‘=’, ‘,’, ‘;’, ‘asm’ or ‘__attribute__’ before ‘int_fast64_t’
    ../corec/corec/portab.h:358: error: expected ‘=’, ‘,’, ‘;’, ‘asm’ or ‘__attribute__’ before ‘uint_fast64_t’
    ../corec/corec/portab.h:404: error: expected ‘=’, ‘,’, ‘;’, ‘asm’ or ‘__attribute__’ before ‘int64_t’
    ../corec/corec/portab.h:405: error: expected ‘=’, ‘,’, ‘;’, ‘asm’ or ‘__attribute__’ before ‘uint64_t’
    ../corec/corec/portab.h:408: error: expected ‘=’, ‘,’, ‘;’, ‘asm’ or ‘__attribute__’ before ‘int_fast32_t’
    ../corec/corec/portab.h:409: error: expected ‘=’, ‘,’, ‘;’, ‘asm’ or ‘__attribute__’ before ‘uint_fast32_t’
    ../corec/corec/portab.h:410: error: expected ‘=’, ‘,’, ‘;’, ‘asm’ or ‘__attribute__’ before ‘int_fast16_t’
    ../corec/corec/portab.h:411: error: expected ‘=’, ‘,’, ‘;’, ‘asm’ or ‘__attribute__’ before ‘uint_fast16_t’
    ../corec/corec/portab.h:414: error: expected ‘=’, ‘,’, ‘;’, ‘asm’ or ‘__attribute__’ before ‘int_fast64_t’
    ../corec/corec/portab.h:415: error: expected ‘=’, ‘,’, ‘;’, ‘asm’ or ‘__attribute__’ before ‘uint_fast64_t’
    ../corec/corec/portab.h:465: error: expected ‘=’, ‘,’, ‘;’, ‘asm’ or ‘__attribute__’ before ‘err_t’
    ../corec/corec/portab.h:466: error: expected ‘=’, ‘,’, ‘;’, ‘asm’ or ‘__attribute__’ before ‘bool_t’
    ../corec/corec/portab.h:467: error: expected ‘=’, ‘,’, ‘;’, ‘asm’ or ‘__attribute__’ before ‘tick_t’
    ../corec/corec/portab.h:482: error: expected specifier-qualifier-list before ‘int_fast32_t’
    ../corec/corec/portab.h:488: error: expected specifier-qualifier-list before ‘int_fast64_t’
    In file included from ../corec/corec/corec.h:43,
    from ../corec/corec/array/array.h:33,
    from ../corec/corec/array/array.c:30:
    ../corec/corec/portab.h:755: error: expected ‘=’, ‘,’, ‘;’, ‘asm’ or ‘__attribute__’ before ‘filepos_t’
    In file included from ../corec/corec/corec.h:46,
    from ../corec/corec/array/array.h:33,
    from ../corec/corec/array/array.c:30:
    ../corec/corec/helper.h:234: error: expected ‘=’, ‘,’, ‘;’, ‘asm’ or ‘__attribute__’ before ‘Scale64’
    ../corec/corec/helper.h:241: error: expected ‘)’ before ‘v’
    ../corec/corec/helper.h: In function ‘Fix16Mul’:
    ../corec/corec/helper.h:256: error: ‘int64_t’ undeclared (first use in this function)
    ../corec/corec/helper.h:256: error: (Each undeclared identifier is reported only once
    ../corec/corec/helper.h:256: error: for each function it appears in.)
    In file included from ../corec/corec/array/array.c:30:
    ../corec/corec/array/array.h: At top level:
    ../corec/corec/array/array.h:49: error: expected ‘=’, ‘,’, ‘;’, ‘asm’ or ‘__attribute__’ before ‘Data_ReAlloc’
    ../corec/corec/array/array.h:53: error: expected ‘=’, ‘,’, ‘;’, ‘asm’ or ‘__attribute__’ before ‘Data_Set’
    ../corec/corec/array/array.h:72: error: expected ‘=’, ‘,’, ‘;’, ‘asm’ or ‘__attribute__’ before ‘ArrayEq’
    ../corec/corec/array/array.h:73: error: expected ‘=’, ‘,’, ‘;’, ‘asm’ or ‘__attribute__’ before ‘ArrayCopy’
    ../corec/corec/array/array.h:74: error: expected ‘=’, ‘,’, ‘;’, ‘asm’ or ‘__attribute__’ before ‘ArrayResize’
    ../corec/corec/array/array.h:76: error: expected ‘=’, ‘,’, ‘;’, ‘asm’ or ‘__attribute__’ before ‘ArrayFindEx’
    ../corec/corec/array/array.h:77: error: expected ‘=’, ‘,’, ‘;’, ‘asm’ or ‘__attribute__’ before ‘ArrayAlloc’
    ../corec/corec/array/array.h:78: error: expected ‘=’, ‘,’, ‘;’, ‘asm’ or ‘__attribute__’ before ‘ArrayAppend’
    ../corec/corec/array/array.h:79: error: expected ‘=’, ‘,’, ‘;’, ‘asm’ or ‘__attribute__’ before ‘ArrayAppendStr’
    ../corec/corec/array/array.h:81: error: expected ‘=’, ‘,’, ‘;’, ‘asm’ or ‘__attribute__’ before ‘ArrayAddEx’
    ../corec/corec/array/array.h:82: error: expected ‘=’, ‘,’, ‘;’, ‘asm’ or ‘__attribute__’ before ‘ArrayRemoveEx’
    ../corec/corec/array/array.h:83: error: expected declaration specifiers or ‘...’ before ‘bool_t’
    ../corec/corec/array/array.h:84: error: expected ‘=’, ‘,’, ‘;’, ‘asm’ or ‘__attribute__’ before ‘ArrayInsert’
    ../corec/corec/array/array.h:108: error: expected specifier-qualifier-list before ‘uintptr_t’
    ../corec/corec/array/array.h:151: error: expected ‘=’, ‘,’, ‘;’, ‘asm’ or ‘__attribute__’ before ‘Fifo_Alloc’
    ../corec/corec/array/array.c:50: error: expected ‘=’, ‘,’, ‘;’, ‘asm’ or ‘__attribute__’ before ‘Data_ReAlloc’
    ../corec/corec/array/array.c: In function ‘Data_Release’:
    ../corec/corec/array/array.c:118: warning: implicit declaration of function ‘free’
    ../corec/corec/array/array.c: At top level:
    ../corec/corec/array/array.c:136: error: expected ‘=’, ‘,’, ‘;’, ‘asm’ or ‘__attribute__’ before ‘Data_Set’
    ../corec/corec/array/array.c:178: error: expected ‘=’, ‘,’, ‘;’, ‘asm’ or ‘__attribute__’ before ‘ArrayAlloc’
    ../corec/corec/array/array.c:194: error: expected ‘=’, ‘,’, ‘;’, ‘asm’ or ‘__attribute__’ before ‘ArrayInsert’
    ../corec/corec/array/array.c: In function ‘ArrayDelete’:
    ../corec/corec/array/array.c:206: warning: implicit declaration of function ‘memmove’
    ../corec/corec/array/array.c:206: warning: incompatible implicit declaration of built-in function ‘memmove’
    ../corec/corec/array/array.c: At top level:
    ../corec/corec/array/array.c:210: error: expected ‘=’, ‘,’, ‘;’, ‘asm’ or ‘__attribute__’ before ‘ArrayAppendStr’
    ../corec/corec/array/array.c:222: error: expected ‘=’, ‘,’, ‘;’, ‘asm’ or ‘__attribute__’ before ‘ArrayAppend’
    ../corec/corec/array/array.c:233: error: expected ‘=’, ‘,’, ‘;’, ‘asm’ or ‘__attribute__’ before ‘ArrayEq’
    ../corec/corec/array/array.c:240: error: expected ‘=’, ‘,’, ‘;’, ‘asm’ or ‘__attribute__’ before ‘ArrayCopy’
    ../corec/corec/array/array.c:249: error: expected ‘=’, ‘,’, ‘;’, ‘asm’ or ‘__attribute__’ before ‘ArrayResize’
    ../corec/corec/array/array.c: In function ‘ArrayZero’:
    ../corec/corec/array/array.c:259: warning: implicit declaration of function ‘memset’
    ../corec/corec/array/array.c:259: warning: incompatible implicit declaration of built-in function ‘memset’
    ../corec/corec/array/array.c: At top level:
    ../corec/corec/array/array.c:264: error: expected ‘)’ before ‘*’ token
    ../corec/corec/array/array.c:271: error: expected ‘)’ before ‘*’ token
    ../corec/corec/array/array.c:341: error: expected declaration specifiers or ‘...’ before ‘bool_t’
    ../corec/corec/array/array.c: In function ‘ArraySortEx’:
    ../corec/corec/array/array.c:348: error: ‘uint_fast32_t’ undeclared (first use in this function)
    ../corec/corec/array/array.c:350: error: ‘End’ undeclared (first use in this function)
    ../corec/corec/array/array.c:350: error: expected expression before ‘)’ token
    ../corec/corec/array/array.c:351: error: ‘i’ undeclared (first use in this function)
    ../corec/corec/array/array.c:352: error: ‘j’ undeclared (first use in this function)
    ../corec/corec/array/array.c:354: warning: implicit declaration of function ‘InQSort’
    ../corec/corec/array/array.c:354: error: expected expression before ‘)’ token
    ../corec/corec/array/array.c:356: error: expected expression before ‘)’ token
    ../corec/corec/array/array.c:361: error: expected ‘;’ before ‘Tmp’
    ../corec/corec/array/array.c:365: error: expected expression before ‘)’ token
    ../corec/corec/array/array.c:368: error: ‘Tmp’ undeclared (first use in this function)
    ../corec/corec/array/array.c:374: error: ‘Unique’ undeclared (first use in this function)
    ../corec/corec/array/array.c:376: error: expected expression before ‘)’ token
    ../corec/corec/array/array.c:399: warning: implicit declaration of function ‘memcpy’
    ../corec/corec/array/array.c:399: warning: incompatible implicit declaration of built-in function ‘memcpy’
    ../corec/corec/array/array.c:424: warning: incompatible implicit declaration of built-in function ‘memcpy’
    ../corec/corec/array/array.c: At top level:
    ../corec/corec/array/array.c:434: error: expected ‘=’, ‘,’, ‘;’, ‘asm’ or ‘__attribute__’ before ‘ArrayFindEx’
    ../corec/corec/array/array.c:494: error: expected ‘=’, ‘,’, ‘;’, ‘asm’ or ‘__attribute__’ before ‘ArrayAddEx’
    ../corec/corec/array/array.c:511: error: expected ‘=’, ‘,’, ‘;’, ‘asm’ or ‘__attribute__’ before ‘ArrayRemoveEx’
    ../corec/corec/array/array.c: In function ‘ArrayRandomize’:
    ../corec/corec/array/array.c:533: warning: incompatible implicit declaration of built-in function ‘memcpy’
    ../corec/corec/array/array.c: At top level:
    ../corec/corec/array/array.c:581: error: expected ‘=’, ‘,’, ‘;’, ‘asm’ or ‘__attribute__’ before ‘Fifo_Alloc’
    ../corec/corec/array/array.c: In function ‘Fifo_Write’:
    ../corec/corec/array/array.c:605: warning: incompatible implicit declaration of built-in function ‘memmove’
    ../corec/corec/array/array.c:614: warning: implicit declaration of function ‘ArrayAlloc’
    ../corec/corec/array/array.c:623: warning: incompatible implicit declaration of built-in function ‘memcpy’
    make[3]: *** [../build/gcc_osx_x64/corec/corec/array/array.ebml2.o] Error 1
    make[2]: *** [../release/gcc_osx_x64/libebml2.a] Error 2
    make[1]: *** [../release/gcc_osx_x64/libmatroska2.a] Error 2
    make: *** [mkclean] Error 2
    x6dev:mkclean-0.8.3 suroot$ sudo make clean
    x6dev:mkclean-0.8.3 suroot$ ./configure
    make[1]: coremake.mak: Permission denied
    make[1]: *** No targets. Stop.
    make: *** [coremake] Error 2
    mv: rename corec/tools/coremake/coremake to ./coremake: No such file or directory
    Running ./coremake gcc_osx_x64
    Now you can run make -C mkclean or gmake -C mkclean
    x6dev:mkclean-0.8.3 suroot$ sudo make -C mkclean
    compiling ../corec/corec/array/array.c
    compiling ../corec/corec/node/node.c
    ../corec/corec/node/node.c: In function ‘Node_GetDataStart’:
    ../corec/corec/node/node.c:527: warning: unused variable ‘p’
    compiling ../corec/corec/node/nodetree.c
    compiling ../corec/corec/str/str.c
    compiling ../corec/corec/str/str_osx.c
    compiling ../corec/helpers/charconvert/charconvert_osx.c
    compiling ../corec/helpers/date/date_libc.c
    compiling ../corec/helpers/file/bufstream.c
    compiling ../corec/helpers/file/file_libc.c
    compiling ../corec/helpers/file/memstream.c
    ../corec/helpers/file/memstream.c: In function ‘MemWrite’:
    ../corec/helpers/file/memstream.c:59: warning: passing argument 1 of ‘memcpy’ discards qualifiers from pointer target type
    compiling ../corec/helpers/file/stream_stdio.c
    compiling ../corec/helpers/file/streams.c
    compiling ../corec/helpers/file/tools.c
    compiling ../corec/helpers/parser/buffer.c
    compiling ../corec/helpers/parser/dataheap.c
    compiling ../corec/helpers/parser/hotkey.c
    compiling ../corec/helpers/parser/nodelookup.c
    compiling ../corec/helpers/parser/parser2.c
    ../corec/helpers/parser/parser2.c: In function ‘ExprIsToken’:
    ../corec/helpers/parser/parser2.c:2022: warning: format not a string literal and no format arguments
    ../corec/helpers/parser/parser2.c: In function ‘ExprIsPoint’:
    ../corec/helpers/parser/parser2.c:2407: warning: format ‘%d’ expects type ‘int’, but argument 3 has type ‘intptr_t *’
    ../corec/helpers/parser/parser2.c:2407: warning: format ‘%d’ expects type ‘int’, but argument 4 has type ‘intptr_t *’
    compiling ../corec/helpers/parser/strtab.c
    compiling ../corec/helpers/parser/strtypes.c
    ../corec/helpers/parser/strtypes.c: In function ‘RFC822ToRel’:
    ../corec/helpers/parser/strtypes.c:504: warning: format ‘%d’ expects type ‘int’, but argument 3 has type ‘intptr_t *’
    ../corec/helpers/parser/strtypes.c:520: warning: format ‘%d’ expects type ‘int’, but argument 3 has type ‘intptr_t *’
    ../corec/helpers/parser/strtypes.c:520: warning: format ‘%d’ expects type ‘int’, but argument 4 has type ‘intptr_t *’
    ../corec/helpers/parser/strtypes.c:520: warning: format ‘%d’ expects type ‘int’, but argument 5 has type ‘intptr_t *’
    ../corec/helpers/parser/strtypes.c:520: warning: format ‘%d’ expects type ‘int’, but argument 6 has type ‘intptr_t *’
    ../corec/helpers/parser/strtypes.c:521: warning: format ‘%d’ expects type ‘int’, but argument 3 has type ‘intptr_t *’
    ../corec/helpers/parser/strtypes.c:521: warning: format ‘%d’ expects type ‘int’, but argument 4 has type ‘intptr_t *’
    ../corec/helpers/parser/strtypes.c:521: warning: format ‘%d’ expects type ‘int’, but argument 5 has type ‘intptr_t *’
    ../corec/helpers/parser/strtypes.c:527: warning: format ‘%d’ expects type ‘int’, but argument 3 has type ‘intptr_t *’
    ../corec/helpers/parser/strtypes.c:529: warning: format ‘%d’ expects type ‘int’, but argument 3 has type ‘intptr_t *’
    ../corec/helpers/parser/strtypes.c: In function ‘ISO8601ToRel’:
    ../corec/helpers/parser/strtypes.c:597: warning: format ‘%d’ expects type ‘int’, but argument 3 has type ‘intptr_t *’
    ../corec/helpers/parser/strtypes.c:597: warning: format ‘%d’ expects type ‘int’, but argument 4 has type ‘intptr_t *’
    ../corec/helpers/parser/strtypes.c:597: warning: format ‘%d’ expects type ‘int’, but argument 5 has type ‘intptr_t *’
    ../corec/helpers/parser/strtypes.c:598: warning: format ‘%d’ expects type ‘int’, but argument 3 has type ‘intptr_t *’
    ../corec/helpers/parser/strtypes.c:598: warning: format ‘%d’ expects type ‘int’, but argument 4 has type ‘intptr_t *’
    ../corec/helpers/parser/strtypes.c:598: warning: format ‘%d’ expects type ‘int’, but argument 5 has type ‘intptr_t *’
    ../corec/helpers/parser/strtypes.c:599: warning: format ‘%4d’ expects type ‘int’, but argument 3 has type ‘intptr_t *’
    ../corec/helpers/parser/strtypes.c:599: warning: format ‘%2d’ expects type ‘int’, but argument 4 has type ‘intptr_t *’
    ../corec/helpers/parser/strtypes.c:599: warning: format ‘%2d’ expects type ‘int’, but argument 5 has type ‘intptr_t *’
    ../corec/helpers/parser/strtypes.c:600: warning: format ‘%2d’ expects type ‘int’, but argument 3 has type ‘intptr_t *’
    ../corec/helpers/parser/strtypes.c:600: warning: format ‘%2d’ expects type ‘int’, but argument 4 has type ‘intptr_t *’
    ../corec/helpers/parser/strtypes.c:600: warning: format ‘%2d’ expects type ‘int’, but argument 5 has type ‘intptr_t *’
    ../corec/helpers/parser/strtypes.c:611: warning: format ‘%d’ expects type ‘int’, but argument 3 has type ‘intptr_t *’
    ../corec/helpers/parser/strtypes.c:611: warning: format ‘%d’ expects type ‘int’, but argument 4 has type ‘intptr_t *’
    ../corec/helpers/parser/strtypes.c:611: warning: format ‘%d’ expects type ‘int’, but argument 5 has type ‘intptr_t *’
    ../corec/helpers/parser/strtypes.c:612: warning: format ‘%2d’ expects type ‘int’, but argument 3 has type ‘intptr_t *’
    ../corec/helpers/parser/strtypes.c:612: warning: format ‘%2d’ expects type ‘int’, but argument 4 has type ‘intptr_t *’
    ../corec/helpers/parser/strtypes.c:612: warning: format ‘%2d’ expects type ‘int’, but argument 5 has type ‘intptr_t *’
    ../corec/helpers/parser/strtypes.c:615: warning: format ‘%d’ expects type ‘int’, but argument 3 has type ‘intptr_t *’
    ../corec/helpers/parser/strtypes.c:620: warning: format ‘%d’ expects type ‘int’, but argument 3 has type ‘intptr_t *’
    ../corec/helpers/parser/strtypes.c:620: warning: format ‘%d’ expects type ‘int’, but argument 4 has type ‘intptr_t *’
    ../corec/helpers/parser/strtypes.c:621: warning: format ‘%2d’ expects type ‘int’, but argument 3 has type ‘intptr_t *’
    ../corec/helpers/parser/strtypes.c:621: warning: format ‘%2d’ expects type ‘int’, but argument 4 has type ‘intptr_t *’
    ../corec/helpers/parser/strtypes.c:622: warning: format ‘%2d’ expects type ‘int’, but argument 3 has type ‘intptr_t *’
    compiling ../corec/helpers/parser/urlpart.c
    compiling ebmlbinary.c
    compiling ebmlcrc.c
    compiling ebmldate.c
    compiling ebmlelement.c
    compiling ebmlmain.c
    ebmlmain.c: In function ‘EBML_FindNextElement’:
    ebmlmain.c:523: warning: assignment discards qualifiers from pointer target type
    ebmlmain.c:600: warning: assignment discards qualifiers from pointer target type
    compiling ebmlmaster.c
    ebmlmaster.c: In function ‘EBML_MasterSort’:
    ebmlmaster.c:149: warning: passing argument 4 of ‘ArraySortEx’ from incompatible pointer type
    compiling ebmlnumber.c
    compiling ebmlstring.c
    compiling ebmlvoid.c
    linking ../release/gcc_osx_x64/libebml2.a
    compiling tremor/bitwise.c
    compiling tremor/block.c
    compiling tremor/codebook.c
    compiling tremor/floor0.c
    compiling tremor/floor1.c
    compiling tremor/info.c
    compiling tremor/mapping0.c
    compiling tremor/mdct.c
    compiling tremor/registry.c
    compiling tremor/res012.c
    compiling tremor/sharedbook.c
    compiling tremor/window.c
    linking ../release/gcc_osx_x64/libtremor.a
    compiling minilzo.c
    linking ../../release/gcc_osx_x64/libminilzo.a
    compiling blocksort.c
    compiling bzlib.c
    compiling compress.c
    compiling crctable.c
    compiling decompress.c
    compiling huffman.c
    compiling randtable.c
    linking ../../release/gcc_osx_x64/libbzlib.a
    compiling ../corec/helpers/zlib/adler32.c
    compiling ../corec/helpers/zlib/compress.c
    compiling ../corec/helpers/zlib/crc32.c
    compiling ../corec/helpers/zlib/deflate.c
    compiling ../corec/helpers/zlib/inffast.c
    compiling ../corec/helpers/zlib/inflate.c
    compiling ../corec/helpers/zlib/inftrees.c
    compiling ../corec/helpers/zlib/trees.c
    compiling ../corec/helpers/zlib/uncompr.c
    compiling ../corec/helpers/zlib/zutil.c
    compiling matroska_sem.c
    compiling matroskablock.c
    compiling matroskamain.c
    matroskamain.c: In function ‘UnCompressFrameZLib’:
    matroskamain.c:1539: warning: assignment discards qualifiers from pointer target type
    linking ../release/gcc_osx_x64/libmatroska2.a
    make[2]: Nothing to be done for `all'.
    make[2]: Nothing to be done for `all'.
    make[2]: Nothing to be done for `all'.
    make[2]: Nothing to be done for `all'.
    compiling mkclean_stdafx.c
    compiling mkclean.c
    mkclean.c: In function ‘CleanTracks’:
    mkclean.c:1091: warning: too many arguments for format
    mkclean.c:1222: warning: suggest parentheses around && within ||
    mkclean.c: In function ‘main’:
    mkclean.c:1729: warning: initialization from incompatible pointer type
    mkclean.c:1735: warning: initialization from incompatible pointer type
    linking ../release/gcc_osx_x64/mkclean
    make[3]: Nothing to be done for `all'.
    make[3]: Nothing to be done for `all'.
    make[3]: Nothing to be done for `all'.
    make[3]: Nothing to be done for `all'.
    make[2]: Nothing to be done for `all'.
    make[2]: Nothing to be done for `all'.
    make[2]: Nothing to be done for `all'.
    make[2]: Nothing to be done for `all'.
    compiling mkWDclean_stdafx.c
    compiling mkclean.c
    mkclean.c: In function ‘CleanTracks’:
    mkclean.c:1091: warning: too many arguments for format
    mkclean.c:1222: warning: suggest parentheses around && within ||
    mkclean.c: In function ‘main’:
    mkclean.c:1729: warning: initialization from incompatible pointer type
    mkclean.c:1735: warning: initialization from incompatible pointer type
    linking ../release/gcc_osx_x64/mkWDclean
    compiling mkcleanreg_stdafx.c
    compiling ../../corec/corec/array/array.c
    compiling ../../corec/corec/node/node.c
    ../../corec/corec/node/node.c: In function ‘Node_GetDataStart’:
    ../../corec/corec/node/node.c:527: warning: unused variable ‘p’
    compiling ../../corec/corec/node/nodetree.c
    compiling ../../corec/corec/str/str.c
    compiling ../../corec/corec/str/str_osx.c
    compiling ../../corec/helpers/charconvert/charconvert_osx.c
    compiling ../../corec/helpers/date/date_libc.c
    compiling ../../corec/helpers/file/bufstream.c
    compiling ../../corec/helpers/file/file_libc.c
    compiling ../../corec/helpers/file/memstream.c
    ../../corec/helpers/file/memstream.c: In function ‘MemWrite’:
    ../../corec/helpers/file/memstream.c:59: warning: passing argument 1 of ‘memcpy’ discards qualifiers from pointer target type
    compiling ../../corec/helpers/file/stream_stdio.c
    compiling ../../corec/helpers/file/streams.c
    compiling ../../corec/helpers/file/tools.c
    compiling ../../corec/helpers/md5/md5.c
    compiling ../../corec/helpers/parser/buffer.c
    compiling ../../corec/helpers/parser/dataheap.c
    compiling ../../corec/helpers/parser/hotkey.c
    compiling ../../corec/helpers/parser/nodelookup.c
    compiling ../../corec/helpers/parser/parser2.c
    ../../corec/helpers/parser/parser2.c: In function ‘ExprIsToken’:
    ../../corec/helpers/parser/parser2.c:2022: warning: format not a string literal and no format arguments
    ../../corec/helpers/parser/parser2.c: In function ‘ExprIsPoint’:
    ../../corec/helpers/parser/parser2.c:2407: warning: format ‘%d’ expects type ‘int’, but argument 3 has type ‘intptr_t *’
    ../../corec/helpers/parser/parser2.c:2407: warning: format ‘%d’ expects type ‘int’, but argument 4 has type ‘intptr_t *’
    compiling ../../corec/helpers/parser/strtab.c
    compiling ../../corec/helpers/parser/strtypes.c
    ../../corec/helpers/parser/strtypes.c: In function ‘RFC822ToRel’:
    ../../corec/helpers/parser/strtypes.c:504: warning: format ‘%d’ expects type ‘int’, but argument 3 has type ‘intptr_t *’
    ../../corec/helpers/parser/strtypes.c:520: warning: format ‘%d’ expects type ‘int’, but argument 3 has type ‘intptr_t *’
    ../../corec/helpers/parser/strtypes.c:520: warning: format ‘%d’ expects type ‘int’, but argument 4 has type ‘intptr_t *’
    ../../corec/helpers/parser/strtypes.c:520: warning: format ‘%d’ expects type ‘int’, but argument 5 has type ‘intptr_t *’
    ../../corec/helpers/parser/strtypes.c:520: warning: format ‘%d’ expects type ‘int’, but argument 6 has type ‘intptr_t *’
    ../../corec/helpers/parser/strtypes.c:521: warning: format ‘%d’ expects type ‘int’, but argument 3 has type ‘intptr_t *’
    ../../corec/helpers/parser/strtypes.c:521: warning: format ‘%d’ expects type ‘int’, but argument 4 has type ‘intptr_t *’
    ../../corec/helpers/parser/strtypes.c:521: warning: format ‘%d’ expects type ‘int’, but argument 5 has type ‘intptr_t *’
    ../../corec/helpers/parser/strtypes.c:527: warning: format ‘%d’ expects type ‘int’, but argument 3 has type ‘intptr_t *’
    ../../corec/helpers/parser/strtypes.c:529: warning: format ‘%d’ expects type ‘int’, but argument 3 has type ‘intptr_t *’
    ../../corec/helpers/parser/strtypes.c: In function ‘ISO8601ToRel’:
    ../../corec/helpers/parser/strtypes.c:597: warning: format ‘%d’ expects type ‘int’, but argument 3 has type ‘intptr_t *’
    ../../corec/helpers/parser/strtypes.c:597: warning: format ‘%d’ expects type ‘int’, but argument 4 has type ‘intptr_t *’
    ../../corec/helpers/parser/strtypes.c:597: warning: format ‘%d’ expects type ‘int’, but argument 5 has type ‘intptr_t *’
    ../../corec/helpers/parser/strtypes.c:598: warning: format ‘%d’ expects type ‘int’, but argument 3 has type ‘intptr_t *’
    ../../corec/helpers/parser/strtypes.c:598: warning: format ‘%d’ expects type ‘int’, but argument 4 has type ‘intptr_t *’
    ../../corec/helpers/parser/strtypes.c:598: warning: format ‘%d’ expects type ‘int’, but argument 5 has type ‘intptr_t *’
    ../../corec/helpers/parser/strtypes.c:599: warning: format ‘%4d’ expects type ‘int’, but argument 3 has type ‘intptr_t *’
    ../../corec/helpers/parser/strtypes.c:599: warning: format ‘%2d’ expects type ‘int’, but argument 4 has type ‘intptr_t *’
    ../../corec/helpers/parser/strtypes.c:599: warning: format ‘%2d’ expects type ‘int’, but argument 5 has type ‘intptr_t *’
    ../../corec/helpers/parser/strtypes.c:600: warning: format ‘%2d’ expects type ‘int’, but argument 3 has type ‘intptr_t *’
    ../../corec/helpers/parser/strtypes.c:600: warning: format ‘%2d’ expects type ‘int’, but argument 4 has type ‘intptr_t *’
    ../../corec/helpers/parser/strtypes.c:600: warning: format ‘%2d’ expects type ‘int’, but argument 5 has type ‘intptr_t *’
    ../../corec/helpers/parser/strtypes.c:611: warning: format ‘%d’ expects type ‘int’, but argument 3 has type ‘intptr_t *’
    ../../corec/helpers/parser/strtypes.c:611: warning: format ‘%d’ expects type ‘int’, but argument 4 has type ‘intptr_t *’
    ../../corec/helpers/parser/strtypes.c:611: warning: format ‘%d’ expects type ‘int’, but argument 5 has type ‘intptr_t *’
    ../../corec/helpers/parser/strtypes.c:612: warning: format ‘%2d’ expects type ‘int’, but argument 3 has type ‘intptr_t *’
    ../../corec/helpers/parser/strtypes.c:612: warning: format ‘%2d’ expects type ‘int’, but argument 4 has type ‘intptr_t *’
    ../../corec/helpers/parser/strtypes.c:612: warning: format ‘%2d’ expects type ‘int’, but argument 5 has type ‘intptr_t *’
    ../../corec/helpers/parser/strtypes.c:615: warning: format ‘%d’ expects type ‘int’, but argument 3 has type ‘intptr_t *’
    ../../corec/helpers/parser/strtypes.c:620: warning: format ‘%d’ expects type ‘int’, but argument 3 has type ‘intptr_t *’
    ../../corec/helpers/parser/strtypes.c:620: warning: format ‘%d’ expects type ‘int’, but argument 4 has type ‘intptr_t *’
    ../../corec/helpers/parser/strtypes.c:621: warning: format ‘%2d’ expects type ‘int’, but argument 3 has type ‘intptr_t *’
    ../../corec/helpers/parser/strtypes.c:621: warning: format ‘%2d’ expects type ‘int’, but argument 4 has type ‘intptr_t *’
    ../../corec/helpers/parser/strtypes.c:622: warning: format ‘%2d’ expects type ‘int’, but argument 3 has type ‘intptr_t *’
    compiling ../../corec/helpers/parser/urlpart.c
    compiling ../../corec/helpers/system/ccsystem_posix.c
    compiling mkcleanreg.c
    mkcleanreg.c: In function ‘main’:
    mkcleanreg.c:255: warning: format ‘%s’ expects type ‘char *’, but argument 4 has type ‘long unsigned int’
    mkcleanreg.c:255: warning: format ‘%lld’ expects type ‘long long int’, but argument 5 has type ‘tchar_t *’
    mkcleanreg.c:255: warning: format ‘%s’ expects type ‘char *’, but argument 6 has type ‘long unsigned int’
    mkcleanreg.c:255: warning: too many arguments for format
    linking ../../release/gcc_osx_x64/mkcleanreg
    make[2]: Nothing to be done for `all'.
    make[2]: Nothing to be done for `all'.
    make[2]: Nothing to be done for `all'.
    make[2]: Nothing to be done for `all'.
    make[1]: Nothing to be done for `all'.
    make[1]: Nothing to be done for `all'.
    make[1]: Nothing to be done for `all'.
    make[1]: Nothing to be done for `all'.

    >>>>>>> Make install log <<<<<<<<<<<<<
    make[3]: Nothing to be done for `all'.
    make[3]: Nothing to be done for `all'.
    make[3]: Nothing to be done for `all'.
    make[3]: Nothing to be done for `all'.
    make[2]: Nothing to be done for `all'.
    make[2]: Nothing to be done for `all'.
    make[2]: Nothing to be done for `all'.
    make[2]: Nothing to be done for `all'.
    linking ../release/gcc_osx_x64/mkclean
    compiling mkvtree_stdafx.c
    compiling mkvtree.c
    mkvtree.c:31:1: warning: "CONFIG_EBML_UNICODE" redefined
    <command-line>: warning: this is the location of the previous definition
    mkvtree.c: In function ‘OutputElement’:
    mkvtree.c:123: warning: too many arguments for format
    mkvtree.c:173: warning: format ‘%04d’ expects type ‘int’, but argument 3 has type ‘intptr_t’
    mkvtree.c:173: warning: format ‘%02d’ expects type ‘int’, but argument 4 has type ‘intptr_t’
    mkvtree.c:173: warning: format ‘%02d’ expects type ‘int’, but argument 5 has type ‘intptr_t’
    mkvtree.c:173: warning: format ‘%02d’ expects type ‘int’, but argument 6 has type ‘intptr_t’
    mkvtree.c:173: warning: format ‘%02d’ expects type ‘int’, but argument 7 has type ‘intptr_t’
    mkvtree.c:173: warning: format ‘%02d’ expects type ‘int’, but argument 8 has type ‘intptr_t’
    mkvtree.c:257: warning: too many arguments for format
    make[3]: Nothing to be done for `all'.
    make[3]: Nothing to be done for `all'.
    make[3]: Nothing to be done for `all'.
    make[3]: Nothing to be done for `all'.
    make[2]: Nothing to be done for `all'.
    make[2]: Nothing to be done for `all'.
    make[2]: Nothing to be done for `all'.
    make[2]: Nothing to be done for `all'.
    linking ../../release/gcc_osx_x64/mkvtree
    make[1]: Nothing to be done for `install'.
    make[1]: Nothing to be done for `install'.
    make[1]: Nothing to be done for `install'.
    make[1]: Nothing to be done for `install'.
    make[1]: Nothing to be done for `install'.

     
  • ggLYLX <a href="http://pdyfiasnnlsw.com/">pdyfiasnnlsw</a>, [url=http://ahmqtqlqqkbk.com/]ahmqtqlqqkbk[/url], [link=http://snblflbqwsil.com/]snblflbqwsil[/link], http://idsurygbqjqt.com/

     
  • oU9zVk <a href="http://xzaexuwqhezn.com/">xzaexuwqhezn</a>, [url=http://gnmgbtxpozag.com/]gnmgbtxpozag[/url], [link=http://ypkvkruuodhq.com/]ypkvkruuodhq[/link], http://cxhnjnntwfil.com/

     
  • I am not sure where you are getting your info, but good topic. I needs to spend some time learning more or understanding more. Thanks for magnificent information I was looking for this information for my mission.
    [url=http://bwgprice.tumblr.com]buy wow gold[/url]
    <a href="http://bwgprice.tumblr.com" title="buy wow gold">buy wow gold</a>

     
  • Wonderful site. A lot of useful information here. I??m sending it to some buddies ans additionally sharing in delicious. And certainly, thanks to your sweat!
    http://rbp2012.tumblr.com

     
  • Very energetic article, I enjoyed that bit. Will there be a part 2?
    Wow Gold $7/10000G - uwowgold http://uwowgold.tumblr.com/

     
  • Its like you read my mind! You appear to know a lot about this, like you wrote the book in it or something. I think that you could do with a few pics to drive the message home a bit, but other than that, this is fantastic blog. An excellent read. I'll certainly be back.
    Wow Gold $7/10000G - uwowgold http://uwowgold.tumblr.com/

     
  • Incredible story there. What occurred after? Thanks!
    how to get cheap Gucci Camel at gfashionstyle.com http://guccishoulder.multiply.com/

     
  • Heya i am for the first time here. I found this board and I find It really useful & it helped me out much. I hope to give something back and aid others like you aided me.
    christian louboutin http://buycheepestclshoes.mm5.pl/

     
  • Definitely, what a splendid website and illuminating posts, I definitely will bookmark your blog.All the Best!
    gw2 gold http://www.guildwars2star.com

     
  • I'm really impressed with your writing skills as well as with the layout on your weblog. Is this a paid theme or did you modify it yourself? Either way keep up the excellent quality writing, it's rare to see a nice blog like this one today..
    diablo 3 gold http://www.d3eye.com

     
  • This info is invaluable. How can I find out more?
    vintage chanel http://vintagechanel.hpage.com/

     
  • Fantastic site. Lots of helpful info here. I am sending it to several friends ans additionally sharing in delicious. And of course, thanks for your effort!
    chanel purses http://chanelpurses.ezweb123.com/

     
  • This design is steller! You most certainly know how to keep a reader amused. Between your wit and your videos, I was almost moved to start my own blog (well, almost...HaHa!) Wonderful job. I really loved what you had to say, and more than that, how you presented it. Too cool!
    cheap north face http://voaxgygsdi.overblog.com/north-face-windbreaker-cowell-is-his-typical-candid

     
  • Hunger is the principal people often lose the battle in a diet. keep in mind that you eat, The more your stomach stretches and therefore you hold more and more food making you gain more weight. Also the bigger you get the more your metabolism slows down making you gain even more weight. This pill helps curb your appetite and speeds up your metabolism which in turn burns more fat and carbs causing you to shed the weight. With a proper diet and medicines the payout is weight loss podedsja.
    Lingzhi Toxin Tea http://www.2daydietbase.com/japan-lingzhi-toxin-tea-p-22.html

     
  • Hello I like your blog. Do you need to visitor publish on my very own at some point? If so please inform me by means of e-mail or perhaps reply to this kind of opinion since We enrolled in notifications and will understand should you choose.
    [url=http://monclerjackets2013.webnode.fr/]moncler jackets[/url]
    <a href="http://monclerjackets2013.webnode.fr/" title="moncler jackets">moncler jackets</a>

     
  • Keep functioning ,splendid job!
    [url=http://blog.wedding-travel.com/meizlistmoshou/]Christophe Beaulieus shop[/url]
    <a href="http://blog.wedding-travel.com/meizlistmoshou/" title="Christophe Beaulieus shop">Christophe Beaulieus shop</a>