#877 Make check fails in 3.11.0

Developer_(v3.11.x)
closed
nobody
Other (122)
5
2012-12-18
2012-12-13
Anonymous
No

Make check fails for my system in 3.11.0

>> /home/melrobin/ATLAS/build/bin/sanity.out
/home/melrobin/ATLAS/build/bin/ATLrun.sh /home/melrobin/ATLAS/build/bin xdslvtst -n 167 -r 83 -O 2 c r -U 2 u l \ >> /home/melrobin/ATLAS/build/bin/sanity.out
/home/melrobin/ATLAS/build/bin/ATLrun.sh /home/melrobin/ATLAS/build/bin xdqrtst -n 1 167 -m 1 83 -U 2 u l \ -S 2 r l >> /home/melrobin/ATLAS/build/bin/sanity.out
make[3]: *** [dsanity_test] Error 4
make[3]: Leaving directory `/home/melrobin/ATLAS/build/bin'
make[2]: *** [sanity_test] Error 2
make[2]: Leaving directory `/home/melrobin/ATLAS/build/bin'
make[1]: *** [sanity_test] Error 2
make[1]: Leaving directory `/home/melrobin/ATLAS/build'
make: *** [test] Error 2

Discussion


  • Anonymous
    2012-12-18

    No problems in 3.11.1

     

  • Anonymous
    2012-12-18

    • status: open --> closed