#29 3.1.13 install dies on cygwin with PIII

Developer_(v3.11.x)
closed
nobody
5
2002-01-22
2002-01-21
eric jones
No

I just downloaded the latest developer release
(3.1.13) and tried to install it using cygwin on a W2K
laptop with a PIII. The laptop is plugged in, and I
only ran the install once -- no left over files or
anything like that. It dies with the following:

ERROR 641 DURING MVTUNE!!. CHECK
INSTALL_LOG/dMVTUNE.LOG FOR DETAILS.

In the install log, it looks like there is a file
(xccobj) that the build is trying to copy on top of
itself. Not sure if this is the problem that is
killing the build or not. I've attached the error tar
ball. Also, I've listed the end of thdMVTUNE.LOG
below:

BEGINNING GEMV PRIMITIVE TESTING:

TEST TA=N, M=997, N=177, lda=1004, beta=0.000000
STARTED
TEST TA=N, M=997, N=177, lda=1004, beta=0.000000
PASSED
TEST TA=N, M=997, N=177, lda=1004, beta=1.000000
STARTED
TEST TA=N, M=997, N=177, lda=1004, beta=1.000000
PASSED
TEST TA=N, M=997, N=177, lda=1004, beta=0.800000
STARTED
TEST TA=N, M=997, N=177, lda=1004, beta=0.800000
PASSED

GEMV PRIMITIVE PASSED ALL TESTS

make[4]: Leaving directory
`/cygdrive/c/home/ej/wrk/ATLAS3.3.13/ATLAS/tune/blas/ge
mv/WinNT_PIIISSE1'

Read in L1 Cache size as = 16KB.
make dmvcaseN mvrout=ATL_gemvN_SSE.c cas=5000 xu=32
yu=2 l1mul=100 iflag=16 gmvout="-o res/dsymvN_5000_0"
EXTFLAGS="-DATL_NOL1PREFETCH -DATL_NOL2PREFETCH" opt="-
2 1 -L 58" M=58 N=32
make[4]: Entering directory
`/cygdrive/c/home/ej/wrk/ATLAS3.3.13/ATLAS/tune/blas/ge
mv/WinNT_PIIISSE1'
/usr/bin/gcc.exe -c -DL2SIZE=524288 -
Ic:/home/ej/wrk/ATLAS3.3.13/ATLAS/include -
Ic:/home/ej/wrk/ATLAS3.3.13/ATLAS/include/WinNT_PIIISSE
1 -Ic:/home/ej/wrk/ATLAS3.3.13/ATLAS/include/contrib -
DAdd__ -DStringSunStyle -DATL_OS_WinNT -
DATL_ARCH_PIII -DGCCWIN -DATL_SSE1 -fomit-frame-
pointer -O3 -funroll-all-loops -DUseClock -o
dgemvtune.o -DDREAL ../gemvtune.c
cp -f
c:/home/ej/wrk/ATLAS3.3.13/ATLAS/bin/WinNT_PIIISSE1/xcc
obj .
cp:
`c:/home/ej/wrk/ATLAS3.3.13/ATLAS/bin/WinNT_PIIISSE1/xc
cobj' and `./xccobj' are the same file
make[4]: *** [xccobj] Error 1
make[4]: Leaving directory
`/cygdrive/c/home/ej/wrk/ATLAS3.3.13/ATLAS/tune/blas/ge
mv/WinNT_PIIISSE1'
make dmvcaseN mvrout=ATL_gemvN_SSE.c cas=5000 xu=2
yu=32 l1mul=100 iflag=16 gmvout="-o
res/dgemvN_5000_100"
make[4]: Entering directory
`/cygdrive/c/home/ej/wrk/ATLAS3.3.13/ATLAS/tune/blas/ge
mv/WinNT_PIIISSE1'
cp -f
c:/home/ej/wrk/ATLAS3.3.13/ATLAS/bin/WinNT_PIIISSE1/xcc
obj .
cp:
`c:/home/ej/wrk/ATLAS3.3.13/ATLAS/bin/WinNT_PIIISSE1/xc
cobj' and `./xccobj' are the same file
make[4]: *** [xccobj] Error 1
make[4]: Leaving directory
`/cygdrive/c/home/ej/wrk/ATLAS3.3.13/ATLAS/tune/blas/ge
mv/WinNT_PIIISSE1'
make dmvcaseT mvrout=ATL_gemvT_SSE.c cas=5000 xu=32
yu=2 l1mul=100 iflag=0 gmvout="-o res/dgemvT_5000_100"
make[4]: Entering directory
`/cygdrive/c/home/ej/wrk/ATLAS3.3.13/ATLAS/tune/blas/ge
mv/WinNT_PIIISSE1'
cp -f
c:/home/ej/wrk/ATLAS3.3.13/ATLAS/bin/WinNT_PIIISSE1/xcc
obj .
cp:
`c:/home/ej/wrk/ATLAS3.3.13/ATLAS/bin/WinNT_PIIISSE1/xc
cobj' and `./xccobj' are the same file
make[4]: *** [xccobj] Error 1
make[4]: Leaving directory
`/cygdrive/c/home/ej/wrk/ATLAS3.3.13/ATLAS/tune/blas/ge
mv/WinNT_PIIISSE1'
make[4]: Entering directory
`/cygdrive/c/home/ej/wrk/ATLAS3.3.13/ATLAS/tune/blas/ge
mv/WinNT_PIIISSE1'
make[4]: `xemit_head' is up to date.
make[4]: Leaving directory
`/cygdrive/c/home/ej/wrk/ATLAS3.3.13/ATLAS/tune/blas/ge
mv/WinNT_PIIISSE1'
./xemit_head -p d -l 100 -N -f 16 -y 32 -x 2 -T -f 0 -
y 2 -x 32 -S -f 16 -y 2 -x 32

Read in L1 Cache size as = 16KB.

Read in L1 Cache size as = 16KB.

Read in L1 Cache size as = 16KB.

Read in L1 Cache size as = 16KB.
make dinstall mvNrout=ATL_gemvN_SSE.c
mvTrout=ATL_gemvT_SSE.c mvSrout=ATL_gemvN_SSE.c
make[4]: Entering directory
`/cygdrive/c/home/ej/wrk/ATLAS3.3.13/ATLAS/tune/blas/ge
mv/WinNT_PIIISSE1'
cp -f
c:/home/ej/wrk/ATLAS3.3.13/ATLAS/bin/WinNT_PIIISSE1/xcc
obj .
cp:
`c:/home/ej/wrk/ATLAS3.3.13/ATLAS/bin/WinNT_PIIISSE1/xc
cobj' and `./xccobj' are the same file
make[4]: *** [xccobj] Error 1
make[4]: Leaving directory
`/cygdrive/c/home/ej/wrk/ATLAS3.3.13/ATLAS/tune/blas/ge
mv/WinNT_PIIISSE1'
assertion "system(ln) == 0" failed:
file "../mvsearch.c", line 629
0 [sig] xmvsearch 1872 open_stackdumpfile:
Dumping stack trace to xmvsearch.exe.stackdump
Signal 6
make[3]: *** [res/dMVRES] Error 134
make[3]: Leaving directory
`/cygdrive/c/home/ej/wrk/ATLAS3.3.13/ATLAS/tune/blas/ge
mv/WinNT_PIIISSE1'
make[2]: ***
[c:/home/ej/wrk/ATLAS3.3.13/ATLAS/tune/blas/gemv/WinNT_
PIIISSE1/res/dMVRES] Error 2
make[2]: Leaving directory
`/cygdrive/c/home/ej/wrk/ATLAS3.3.13/ATLAS/bin/WinNT_PI
IISSE1'

Discussion

  • eric jones
    eric jones
    2002-01-21

    error file tar ball

     
  • eric jones
    eric jones
    2002-01-22

    • status: open --> closed
     
  • eric jones
    eric jones
    2002-01-22

    Logged In: YES
    user_id=224884

    I have done a couple of things, and the problem has gone
    away. Not sure which fixed it:

    1) upgraded to latest Cygwin distribution -- 1.3.9
    2) Built in /home/eric instead of a c:\... rooted
    directory.

    eric