Problems comping on RH9

  • hey all,

    having problems compiling on RH9 getting the following during 'make':

    /usr/bin/ld: cannot find -ldb1
    collect2: ld returned 1 exit status
    make[2]: *** [lufsd] Error 1
    make[2]: Leaving directory `/tmp/lufs-0.9.6/lufsd'
    make[1]: *** [all-recursive] Error 1
    make[1]: Leaving directory `/tmp/lufs-0.9.6'
    make: *** [all] Error 2

    obviously that means that 'ldb1' is not around - from a bit of googling it seems to be 'lib-db' which implies BDB  which i have 4.1.25 installed. any other ideas where i can get this from?

    • fixed now - see next post for the next problem...