#82 Can't install --- unresolved symbols

closed-fixed
nobody
None
5
2004-05-12
2004-05-11
No

When I try to install LUFS I get the following errors.
configure and make work just fine but then:

houseman:/usr/src/lufs# make install
Making install in kernel
make[1]: Entering directory `/usr/src/lufs/kernel'
Making install in Linux
make[2]: Entering directory `/usr/src/lufs/kernel/Linux'
Making install in 2.4
make[3]: Entering directory
`/usr/src/lufs/kernel/Linux/2.4'
make[4]: Entering directory
`/usr/src/lufs/kernel/Linux/2.4'
make[4]: Nothing to be done for `install-exec-am'.
/bin/sh ../../../config/mkinstalldirs
/lib/modules/2.4.21-houseman.0/kernel/fs/lufs
/bin/sh ../../../libtool --mode=install
/usr/bin/install -c lufs.o
/lib/modules/2.4.21-houseman.0/kernel/fs/lufs/lufs.o
/usr/bin/install -c lufs.o
/lib/modules/2.4.21-houseman.0/kernel/fs/lufs/lufs.o
make install-data-hook
make[5]: Entering directory
`/usr/src/lufs/kernel/Linux/2.4'
depmod -aq
if [ "`lsmod | grep lufs`" ]; then rmmod lufs; fi
modprobe lufs
/lib/modules/2.4.21-houseman.0/kernel/fs/lufs/lufs.o:
unresolved symbol put_cmsg
/lib/modules/2.4.21-houseman.0/kernel/fs/lufs/lufs.o:
unresolved symbol generic_file_llseek
/lib/modules/2.4.21-houseman.0/kernel/fs/lufs/lufs.o:
unresolved symbol generic_file_write
/lib/modules/2.4.21-houseman.0/kernel/fs/lufs/lufs.o:
unresolved symbol unlock_page
/lib/modules/2.4.21-houseman.0/kernel/fs/lufs/lufs.o:
unresolved symbol clear_inode
/lib/modules/2.4.21-houseman.0/kernel/fs/lufs/lufs.o:
unresolved symbol kmalloc
/lib/modules/2.4.21-houseman.0/kernel/fs/lufs/lufs.o:
unresolved symbol new_inode
/lib/modules/2.4.21-houseman.0/kernel/fs/lufs/lufs.o:
unresolved symbol generic_read_dir
/lib/modules/2.4.21-houseman.0/kernel/fs/lufs/lufs.o:
unresolved symbol scm_detach_fds
/lib/modules/2.4.21-houseman.0/kernel/fs/lufs/lufs.o:
unresolved symbol unregister_filesystem
/lib/modules/2.4.21-houseman.0/kernel/fs/lufs/lufs.o:
unresolved symbol vfs_readlink
/lib/modules/2.4.21-houseman.0/kernel/fs/lufs/lufs.o:
unresolved symbol force_delete
/lib/modules/2.4.21-houseman.0/kernel/fs/lufs/lufs.o:
unresolved symbol find_inode_number
/lib/modules/2.4.21-houseman.0/kernel/fs/lufs/lufs.o:
unresolved symbol generic_file_mmap
/lib/modules/2.4.21-houseman.0/kernel/fs/lufs/lufs.o:
unresolved symbol is_bad_inode
/lib/modules/2.4.21-houseman.0/kernel/fs/lufs/lufs.o:
unresolved symbol d_rehash
/lib/modules/2.4.21-houseman.0/kernel/fs/lufs/lufs.o:
unresolved symbol make_bad_inode
/lib/modules/2.4.21-houseman.0/kernel/fs/lufs/lufs.o:
unresolved symbol generic_file_read
/lib/modules/2.4.21-houseman.0/kernel/fs/lufs/lufs.o:
unresolved symbol generic_file_open
/lib/modules/2.4.21-houseman.0/kernel/fs/lufs/lufs.o:
unresolved symbol register_filesystem
/lib/modules/2.4.21-houseman.0/kernel/fs/lufs/lufs.o:
unresolved symbol zone_table
/lib/modules/2.4.21-houseman.0/kernel/fs/lufs/lufs.o:
unresolved symbol invalidate_inode_pages
/lib/modules/2.4.21-houseman.0/kernel/fs/lufs/lufs.o:
unresolved symbol d_alloc_root
/lib/modules/2.4.21-houseman.0/kernel/fs/lufs/lufs.o:
unresolved symbol kill_proc_info
/lib/modules/2.4.21-houseman.0/kernel/fs/lufs/lufs.o:
unresolved symbol kfree
/lib/modules/2.4.21-houseman.0/kernel/fs/lufs/lufs.o:
unresolved symbol iunique
/lib/modules/2.4.21-houseman.0/kernel/fs/lufs/lufs.o:
unresolved symbol vfs_follow_link
/lib/modules/2.4.21-houseman.0/kernel/fs/lufs/lufs.o:
unresolved symbol __scm_destroy
/lib/modules/2.4.21-houseman.0/kernel/fs/lufs/lufs.o:
unresolved symbol xtime
/lib/modules/2.4.21-houseman.0/kernel/fs/lufs/lufs.o:
unresolved symbol sock_release
/lib/modules/2.4.21-houseman.0/kernel/fs/lufs/lufs.o:
unresolved symbol simple_strtoul
/lib/modules/2.4.21-houseman.0/kernel/fs/lufs/lufs.o:
unresolved symbol sock_create
/lib/modules/2.4.21-houseman.0/kernel/fs/lufs/lufs.o:
unresolved symbol jiffies
/lib/modules/2.4.21-houseman.0/kernel/fs/lufs/lufs.o:
unresolved symbol d_instantiate
/lib/modules/2.4.21-houseman.0/kernel/fs/lufs/lufs.o:
unresolved symbol insert_inode_hash
/lib/modules/2.4.21-houseman.0/kernel/fs/lufs/lufs.o:
unresolved symbol __free_pages
/lib/modules/2.4.21-houseman.0/kernel/fs/lufs/lufs.o:
unresolved symbol strtok
/lib/modules/2.4.21-houseman.0/kernel/fs/lufs/lufs.o:
unresolved symbol printk
/lib/modules/2.4.21-houseman.0/kernel/fs/lufs/lufs.o:
unresolved symbol __scm_send
/lib/modules/2.4.21-houseman.0/kernel/fs/lufs/lufs.o:
insmod
/lib/modules/2.4.21-houseman.0/kernel/fs/lufs/lufs.o failed
/lib/modules/2.4.21-houseman.0/kernel/fs/lufs/lufs.o:
insmod lufs failed
make[5]: *** [install-data-hook] Error 255
make[5]: Leaving directory `/usr/src/lufs/kernel/Linux/2.4'
make[4]: *** [install-data-am] Error 2
make[4]: Leaving directory `/usr/src/lufs/kernel/Linux/2.4'
make[3]: *** [install-am] Error 2
make[3]: Leaving directory `/usr/src/lufs/kernel/Linux/2.4'
make[2]: *** [install-recursive] Error 1
make[2]: Leaving directory `/usr/src/lufs/kernel/Linux'
make[1]: *** [install-recursive] Error 1
make[1]: Leaving directory `/usr/src/lufs/kernel'
make: *** [install-recursive] Error 1

I also tried to build it statically ...

Thank You

Discussion

    • status: open --> closed
     
    • status: closed --> closed-fixed
     
  • Logged In: YES
    user_id=186848

    I had to disable modversions and then it was fine ...