LTP Output/Log (Report Generated on Thu Mar 27 12:33:27 CDT 2008)

 PASSED   FAILED   WARNING   BROKEN   RETIRED   CONFIG-ERROR 

  • Click Here for Detailed Report
  • Click Here for Summary Report

  • Detailed Report

    No Test-Name Start-Time Command-Line Contacts Analysis Initiation-Status Test-Output Duration Termination-type Termination-id Core-File cutime cstime

    1

    rwtest03

    Thu Mar 27 12:33:27 2008

    "export LTPROOT; rwtest -N rwtest03 -c -q -i 60s -n 2 -f buffered -s mmread,mmwrite -m random -Dv 10%25000:mm-buff-$$"

    ""

    exit

    "ok"

     
    doio(rwtest03) ( 4123) 12:33:27 
    --------------------- 
    *** DATA COMPARISON ERROR *** 
    check_file(/tmp/ltp-4003/mm-buff-4106, 12646555, 38742, K:4123:cell21b:doio*, 20, 0) failed 
     
    Comparison fd is 4, with open flags 0 
    Corrupt regions follow - unprintable chars are represented as '.' 
    ----------------------------------------------------------------- 
    corrupt bytes starting at file offset 12646555 
        1st 32 expected bytes:  K:4123:cell21b:doio*K:4123:cell2 
        1st 32 actual bytes:    ................................ 
     
    Request number 3 
              fd 5 is file /tmp/ltp-4003/mm-buff-4106 - open flags are 02 O_RDWR, 
              write done at file offset 12646555 - pattern is K (0113) 
              number of requests is 1, strides per request is 1 
              i/o byte count = 38742 
              memory alignment is unaligned 
     
    syscall:  mmap-write(NULL, 12800000, PROT_WRITE, MAP_SHARED, 5, 0) 
    	file is mmaped to: 0xf73b0000 
    	file-mem=0xf7fbf89b, length=38742, buffer=0x10031321 
     
     
    doio(rwtest03) ( 4121) 12:33:27 
    --------------------- 
    (parent) pid 4123 exited because of data compare errors 
    rwtest(rwtest03) : doio reported errors (r=4) 
    rwtest03    1  FAIL  :  doio reported errors (r=4) 
    rwtest03    1  FAIL  :  Test failed 
    

    138

    exited

    4

    no

    474

    3191

    2

    dio04

    Thu Mar 27 12:35:45 2008

    "diotest4"

    ""

    exit

    "ok"

    diotest4    1  PASS  :  Negative Offset 
    diotest4    2  PASS  :  removed 
    diotest4    3  FAIL  :  read allows odd count. returns 1: Invalid argument 
    diotest4    4  FAIL  :  write allows odd count.returns 1: Invalid argument 
    diotest4    5  FAIL  :  Odd count of read and write 
    diotest4    6  PASS  :  Read beyond the file size 
    diotest4    7  PASS  :  Invalid file descriptor 
    diotest4    8  PASS  :  Out of range file descriptor 
    diotest4    9  PASS  :  Closed file descriptor 
    diotest4   10  PASS  :  removed 
    diotest4   11  CONF  :  Direct I/O on /dev/null is not supported 
    diotest4   12  PASS  :  read, write to a mmaped file 
    diotest4   13  PASS  :  read, write to an unmapped file 
    diotest4   14  PASS  :  read from file not open for reading 
    diotest4   15  PASS  :  write to file not open for writing 
    diotest4   16  FAIL  :  allows read nonaligned buf. returns 4096: Bad file descriptor 
    diotest4   17  FAIL  :  allows write nonaligned buf. returns 4096: Bad file descriptor 
    diotest4   18  FAIL  :  read, write with non-aligned buffer 
    diotest4   19  PASS  :  read, write buffer in read-only space 
    diotest4   20  PASS  :  read, write in non-existant space 
    diotest4   21  PASS  :  read, write for file with O_SYNC 
    diotest4    0  INFO  :  2/15 test blocks failed 
    

    0

    exited

    1

    no

    0

    1

    3

    fcntl14

    Thu Mar 27 12:35:45 2008

    "fcntl14"

    ""

    exit

    "ok"

    fcntl14     0  INFO  :  Enter block 1: without mandatory locking 
    fcntl14     1  PASS  :  testcase:1 PASSED 
    fcntl14     2  PASS  :  testcase:2 PASSED 
    fcntl14     3  PASS  :  testcase:3 PASSED 
    fcntl14     4  PASS  :  testcase:4 PASSED 
    fcntl14     5  PASS  :  testcase:5 PASSED 
    fcntl14     6  PASS  :  testcase:6 PASSED 
    fcntl14     7  PASS  :  testcase:7 PASSED 
    fcntl14     8  PASS  :  testcase:8 PASSED 
    fcntl14     9  PASS  :  testcase:9 PASSED 
    fcntl14    10  PASS  :  testcase:10 PASSED 
    fcntl14    11  PASS  :  testcase:11 PASSED 
    fcntl14    12  PASS  :  testcase:12 PASSED 
    fcntl14    13  PASS  :  testcase:13 PASSED 
    fcntl14    14  PASS  :  testcase:14 PASSED 
    fcntl14    15  PASS  :  testcase:15 PASSED 
    fcntl14    16  PASS  :  testcase:16 PASSED 
    fcntl14    17  PASS  :  testcase:17 PASSED 
    fcntl14    18  PASS  :  testcase:18 PASSED 
    fcntl14    19  PASS  :  testcase:19 PASSED 
    fcntl14    20  PASS  :  testcase:20 PASSED 
    fcntl14    21  PASS  :  testcase:21 PASSED 
    fcntl14    22  PASS  :  testcase:22 PASSED 
    fcntl14    23  PASS  :  testcase:23 PASSED 
    fcntl14    24  PASS  :  testcase:24 PASSED 
    fcntl14    25  PASS  :  testcase:25 PASSED 
    fcntl14    26  PASS  :  testcase:26 PASSED 
    fcntl14    27  PASS  :  testcase:27 PASSED 
    fcntl14    28  PASS  :  testcase:28 PASSED 
    fcntl14    29  PASS  :  testcase:29 PASSED 
    fcntl14    30  PASS  :  testcase:30 PASSED 
    fcntl14    31  PASS  :  testcase:31 PASSED 
    fcntl14    32  PASS  :  testcase:32 PASSED 
    fcntl14    33  PASS  :  testcase:33 PASSED 
    fcntl14    34  PASS  :  testcase:34 PASSED 
    fcntl14    35  PASS  :  testcase:35 PASSED 
    fcntl14    36  PASS  :  testcase:36 PASSED 
    fcntl14    37  PASS  :  Block 1, test 1 PASSED 
    fcntl14    38  PASS  :  testcase:37 PASSED 
    fcntl14    39  PASS  :  testcase:38 PASSED 
    fcntl14    40  PASS  :  testcase:39 PASSED 
    fcntl14    41  PASS  :  testcase:40 PASSED 
    fcntl14    42  PASS  :  testcase:41 PASSED 
    fcntl14    43  PASS  :  testcase:42 PASSED 
    fcntl14    44  PASS  :  testcase:43 PASSED 
    fcntl14    45  PASS  :  testcase:44 PASSED 
    fcntl14    46  PASS  :  testcase:45 PASSED 
    fcntl14    47  PASS  :  Block 1, test 2 PASSED 
    fcntl14     0  INFO  :  Exit block 1 
    fcntl14     0  INFO  :  Enter block 2: with mandatory locking 
    fcntl14    48  FAIL  :  First parent lock failed 
    fcntl14    49  FAIL  :  Test case 1, errno = 37 
    fcntl14    50  FAIL  :  Attempt to check lock status failed 
    fcntl14    51  FAIL  :  Test case 1, errno = 37 
    fcntl14    52  FAIL  :  SETLK: rc = -1, errno = 37, -1/EAGAIN or EACCES was expected 
    fcntl14    50  FAIL  :  Attempt to check lock status failed 
    fcntl14    51  FAIL  :  Test case 1, errno = 37 
    fcntl14    52  FAIL  :  SETLK: rc = -1, errno = 37, -1/EAGAIN or EACCES was expected 
    fcntl14    53  FAIL  :  Attempt to set child BLOCKING lock failed 
    fcntl14    54  FAIL  :  Test case 1, errno = 37 
    fcntl14    50  FAIL  :  tchild returned status 0x100 
    fcntl14    51  FAIL  :  testcase:1 FAILED 
    fcntl14    52  FAIL  :  First parent lock failed 
    fcntl14    53  FAIL  :  Test case 2, errno = 37 
    fcntl14    54  FAIL  :  Attempt to check lock status failed 
    fcntl14    55  FAIL  :  Test case 2, errno = 37 
    fcntl14    56  FAIL  :  SETLK: rc = -1, errno = 37, -1/EAGAIN or EACCES was expected 
    fcntl14    54  FAIL  :  Attempt to check lock status failed 
    fcntl14    55  FAIL  :  Test case 2, errno = 37 
    fcntl14    56  FAIL  :  SETLK: rc = -1, errno = 37, -1/EAGAIN or EACCES was expected 
    fcntl14    57  FAIL  :  Attempt to set child BLOCKING lock failed 
    fcntl14    58  FAIL  :  Test case 2, errno = 37 
    fcntl14    54  FAIL  :  tchild returned status 0x100 
    fcntl14    55  FAIL  :  testcase:2 FAILED 
    fcntl14    56  FAIL  :  First parent lock failed 
    fcntl14    57  FAIL  :  Test case 3, errno = 37 
    fcntl14    58  FAIL  :  Attempt to check lock status failed 
    fcntl14    59  FAIL  :  Test case 3, errno = 37 
    fcntl14    60  FAIL  :  Attempt to set child NONBLOCKING lock failed 
    fcntl14    61  FAIL  :  Test case 3, errno = 37 
    fcntl14    58  FAIL  :  tchild returned status 0x100 
    fcntl14    59  FAIL  :  testcase:3 FAILED 
    fcntl14    60  FAIL  :  First parent lock failed 
    fcntl14    61  FAIL  :  Test case 4, errno = 37 
    fcntl14    62  FAIL  :  Attempt to check lock status failed 
    fcntl14    63  FAIL  :  Test case 4, errno = 37 
    fcntl14    64  FAIL  :  SETLK: rc = -1, errno = 37, -1/EAGAIN or EACCES was expected 
    fcntl14    62  FAIL  :  Attempt to check lock status failed 
    fcntl14    63  FAIL  :  Test case 4, errno = 37 
    fcntl14    64  FAIL  :  SETLK: rc = -1, errno = 37, -1/EAGAIN or EACCES was expected 
    fcntl14    65  FAIL  :  Attempt to set child BLOCKING lock failed 
    fcntl14    66  FAIL  :  Test case 4, errno = 37 
    fcntl14    62  FAIL  :  tchild returned status 0x100 
    fcntl14    63  FAIL  :  testcase:4 FAILED 
    fcntl14    64  FAIL  :  First parent lock failed 
    fcntl14    65  FAIL  :  Test case 5, errno = 37 
    fcntl14    66  FAIL  :  Attempt to check lock status failed 
    fcntl14    67  FAIL  :  Test case 5, errno = 37 
    fcntl14    68  FAIL  :  SETLK: rc = -1, errno = 37, -1/EAGAIN or EACCES was expected 
    fcntl14    66  FAIL  :  Attempt to check lock status failed 
    fcntl14    67  FAIL  :  Test case 5, errno = 37 
    fcntl14    68  FAIL  :  SETLK: rc = -1, errno = 37, -1/EAGAIN or EACCES was expected 
    fcntl14    69  FAIL  :  Attempt to set child BLOCKING lock failed 
    fcntl14    70  FAIL  :  Test case 5, errno = 37 
    fcntl14    66  FAIL  :  tchild returned status 0x100 
    fcntl14    67  FAIL  :  testcase:5 FAILED 
    fcntl14    68  FAIL  :  First parent lock failed 
    fcntl14    69  FAIL  :  Test case 6, errno = 37 
    fcntl14    70  FAIL  :  Attempt to check lock status failed 
    fcntl14    71  FAIL  :  Test case 6, errno = 37 
    fcntl14    72  FAIL  :  SETLK: rc = -1, errno = 37, -1/EAGAIN or EACCES was expected 
    fcntl14    70  FAIL  :  Attempt to check lock status failed 
    fcntl14    71  FAIL  :  Test case 6, errno = 37 
    fcntl14    72  FAIL  :  SETLK: rc = -1, errno = 37, -1/EAGAIN or EACCES was expected 
    fcntl14    73  FAIL  :  Attempt to set child BLOCKING lock failed 
    fcntl14    74  FAIL  :  Test case 6, errno = 37 
    fcntl14    70  FAIL  :  tchild returned status 0x100 
    fcntl14    71  FAIL  :  testcase:6 FAILED 
    fcntl14    72  FAIL  :  First parent lock failed 
    fcntl14    73  FAIL  :  Test case 7, errno = 37 
    fcntl14    74  FAIL  :  Attempt to check lock status failed 
    fcntl14    75  FAIL  :  Test case 7, errno = 37 
    fcntl14    76  FAIL  :  Attempt to set child NONBLOCKING lock failed 
    fcntl14    77  FAIL  :  Test case 7, errno = 37 
    fcntl14    74  FAIL  :  tchild returned status 0x100 
    fcntl14    75  FAIL  :  testcase:7 FAILED 
    fcntl14    76  FAIL  :  First parent lock failed 
    fcntl14    77  FAIL  :  Test case 8, errno = 37 
    fcntl14    78  FAIL  :  Attempt to check lock status failed 
    fcntl14    79  FAIL  :  Test case 8, errno = 37 
    fcntl14    80  FAIL  :  SETLK: rc = -1, errno = 37, -1/EAGAIN or EACCES was expected 
    fcntl14    78  FAIL  :  Attempt to check lock status failed 
    fcntl14    79  FAIL  :  Test case 8, errno = 37 
    fcntl14    80  FAIL  :  SETLK: rc = -1, errno = 37, -1/EAGAIN or EACCES was expected 
    fcntl14    81  FAIL  :  Attempt to set child BLOCKING lock failed 
    fcntl14    82  FAIL  :  Test case 8, errno = 37 
    fcntl14    78  FAIL  :  tchild returned status 0x100 
    fcntl14    79  FAIL  :  testcase:8 FAILED 
    fcntl14    80  FAIL  :  First parent lock failed 
    fcntl14    81  FAIL  :  Test case 9, errno = 37 
    fcntl14    82  FAIL  :  Attempt to check lock status failed 
    fcntl14    83  FAIL  :  Test case 9, errno = 37 
    fcntl14    84  FAIL  :  SETLK: rc = -1, errno = 37, -1/EAGAIN or EACCES was expected 
    fcntl14    82  FAIL  :  Attempt to check lock status failed 
    fcntl14    83  FAIL  :  Test case 9, errno = 37 
    fcntl14    84  FAIL  :  SETLK: rc = -1, errno = 37, -1/EAGAIN or EACCES was expected 
    fcntl14    85  FAIL  :  Attempt to set child BLOCKING lock failed 
    fcntl14    86  FAIL  :  Test case 9, errno = 37 
    fcntl14    82  FAIL  :  tchild returned status 0x100 
    fcntl14    83  FAIL  :  testcase:9 FAILED 
    fcntl14    84  FAIL  :  First parent lock failed 
    fcntl14    85  FAIL  :  Test case 10, errno = 37 
    fcntl14    86  FAIL  :  Attempt to check lock status failed 
    fcntl14    87  FAIL  :  Test case 10, errno = 37 
    fcntl14    88  FAIL  :  SETLK: rc = -1, errno = 37, -1/EAGAIN or EACCES was expected 
    fcntl14    86  FAIL  :  Attempt to check lock status failed 
    fcntl14    87  FAIL  :  Test case 10, errno = 37 
    fcntl14    88  FAIL  :  SETLK: rc = -1, errno = 37, -1/EAGAIN or EACCES was expected 
    fcntl14    89  FAIL  :  Attempt to set child BLOCKING lock failed 
    fcntl14    90  FAIL  :  Test case 10, errno = 37 
    fcntl14    86  FAIL  :  tchild returned status 0x100 
    fcntl14    87  FAIL  :  testcase:10 FAILED 
    fcntl14    88  FAIL  :  First parent lock failed 
    fcntl14    89  FAIL  :  Test case 11, errno = 37 
    fcntl14    90  FAIL  :  Attempt to check lock status failed 
    fcntl14    91  FAIL  :  Test case 11, errno = 37 
    fcntl14    92  FAIL  :  Attempt to set child NONBLOCKING lock failed 
    fcntl14    93  FAIL  :  Test case 11, errno = 37 
    fcntl14    90  FAIL  :  tchild returned status 0x100 
    fcntl14    91  FAIL  :  testcase:11 FAILED 
    fcntl14    92  FAIL  :  First parent lock failed 
    fcntl14    93  FAIL  :  Test case 12, errno = 37 
    fcntl14    94  FAIL  :  Attempt to check lock status failed 
    fcntl14    95  FAIL  :  Test case 12, errno = 37 
    fcntl14    96  FAIL  :  SETLK: rc = -1, errno = 37, -1/EAGAIN or EACCES was expected 
    fcntl14    94  FAIL  :  Attempt to check lock status failed 
    fcntl14    95  FAIL  :  Test case 12, errno = 37 
    fcntl14    96  FAIL  :  SETLK: rc = -1, errno = 37, -1/EAGAIN or EACCES was expected 
    fcntl14    97  FAIL  :  Attempt to set child BLOCKING lock failed 
    fcntl14    98  FAIL  :  Test case 12, errno = 37 
    fcntl14    94  FAIL  :  tchild returned status 0x100 
    fcntl14    95  FAIL  :  testcase:12 FAILED 
    fcntl14    96  FAIL  :  First parent lock failed 
    fcntl14    97  FAIL  :  Test case 13, errno = 37 
    fcntl14    98  FAIL  :  Attempt to check lock status failed 
    fcntl14    99  FAIL  :  Test case 13, errno = 37 
    fcntl14   100  FAIL  :  SETLK: rc = -1, errno = 37, -1/EAGAIN or EACCES was expected 
    fcntl14    98  FAIL  :  Attempt to check lock status failed 
    fcntl14    99  FAIL  :  Test case 13, errno = 37 
    fcntl14   100  FAIL  :  SETLK: rc = -1, errno = 37, -1/EAGAIN or EACCES was expected 
    fcntl14   101  FAIL  :  Attempt to set child BLOCKING lock failed 
    fcntl14   102  FAIL  :  Test case 13, errno = 37 
    fcntl14    98  FAIL  :  tchild returned status 0x100 
    fcntl14    99  FAIL  :  testcase:13 FAILED 
    fcntl14   100  FAIL  :  First parent lock failed 
    fcntl14   101  FAIL  :  Test case 14, errno = 37 
    fcntl14   102  FAIL  :  Attempt to check lock status failed 
    fcntl14   103  FAIL  :  Test case 14, errno = 37 
    fcntl14   104  FAIL  :  SETLK: rc = -1, errno = 37, -1/EAGAIN or EACCES was expected 
    fcntl14   102  FAIL  :  Attempt to check lock status failed 
    fcntl14   103  FAIL  :  Test case 14, errno = 37 
    fcntl14   104  FAIL  :  SETLK: rc = -1, errno = 37, -1/EAGAIN or EACCES was expected 
    fcntl14   105  FAIL  :  Attempt to set child BLOCKING lock failed 
    fcntl14   106  FAIL  :  Test case 14, errno = 37 
    fcntl14   102  FAIL  :  tchild returned status 0x100 
    fcntl14   103  FAIL  :  testcase:14 FAILED 
    fcntl14   104  FAIL  :  First parent lock failed 
    fcntl14   105  FAIL  :  Test case 15, errno = 37 
    fcntl14   106  FAIL  :  Attempt to check lock status failed 
    fcntl14   107  FAIL  :  Test case 15, errno = 37 
    fcntl14   108  FAIL  :  Attempt to set child NONBLOCKING lock failed 
    fcntl14   109  FAIL  :  Test case 15, errno = 37 
    fcntl14   106  FAIL  :  tchild returned status 0x100 
    fcntl14   107  FAIL  :  testcase:15 FAILED 
    fcntl14   108  FAIL  :  First parent lock failed 
    fcntl14   109  FAIL  :  Test case 16, errno = 37 
    fcntl14   110  FAIL  :  Attempt to check lock status failed 
    fcntl14   111  FAIL  :  Test case 16, errno = 37 
    fcntl14   112  FAIL  :  SETLK: rc = -1, errno = 37, -1/EAGAIN or EACCES was expected 
    fcntl14   110  FAIL  :  Attempt to check lock status failed 
    fcntl14   111  FAIL  :  Test case 16, errno = 37 
    fcntl14   112  FAIL  :  SETLK: rc = -1, errno = 37, -1/EAGAIN or EACCES was expected 
    fcntl14   113  FAIL  :  Attempt to set child BLOCKING lock failed 
    fcntl14   114  FAIL  :  Test case 16, errno = 37 
    fcntl14   110  FAIL  :  tchild returned status 0x100 
    fcntl14   111  FAIL  :  testcase:16 FAILED 
    fcntl14   112  FAIL  :  First parent lock failed 
    fcntl14   113  FAIL  :  Test case 17, errno = 37 
    fcntl14   114  FAIL  :  Attempt to check lock status failed 
    fcntl14   115  FAIL  :  Test case 17, errno = 37 
    fcntl14   116  FAIL  :  SETLK: rc = -1, errno = 37, -1/EAGAIN or EACCES was expected 
    fcntl14   114  FAIL  :  Attempt to check lock status failed 
    fcntl14   115  FAIL  :  Test case 17, errno = 37 
    fcntl14   116  FAIL  :  SETLK: rc = -1, errno = 37, -1/EAGAIN or EACCES was expected 
    fcntl14   117  FAIL  :  Attempt to set child BLOCKING lock failed 
    fcntl14   118  FAIL  :  Test case 17, errno = 37 
    fcntl14   114  FAIL  :  tchild returned status 0x100 
    fcntl14   115  FAIL  :  testcase:17 FAILED 
    fcntl14   116  FAIL  :  First parent lock failed 
    fcntl14   117  FAIL  :  Test case 18, errno = 37 
    fcntl14   118  FAIL  :  Attempt to check lock status failed 
    fcntl14   119  FAIL  :  Test case 18, errno = 37 
    fcntl14   120  FAIL  :  SETLK: rc = -1, errno = 37, -1/EAGAIN or EACCES was expected 
    fcntl14   118  FAIL  :  Attempt to check lock status failed 
    fcntl14   119  FAIL  :  Test case 18, errno = 37 
    fcntl14   120  FAIL  :  SETLK: rc = -1, errno = 37, -1/EAGAIN or EACCES was expected 
    fcntl14   121  FAIL  :  Attempt to set child BLOCKING lock failed 
    fcntl14   122  FAIL  :  Test case 18, errno = 37 
    fcntl14   118  FAIL  :  tchild returned status 0x100 
    fcntl14   119  FAIL  :  testcase:18 FAILED 
    fcntl14   120  FAIL  :  First parent lock failed 
    fcntl14   121  FAIL  :  Test case 19, errno = 37 
    fcntl14   122  FAIL  :  Attempt to check lock status failed 
    fcntl14   123  FAIL  :  Test case 19, errno = 37 
    fcntl14   124  FAIL  :  Attempt to set child NONBLOCKING lock failed 
    fcntl14   125  FAIL  :  Test case 19, errno = 37 
    fcntl14   122  FAIL  :  tchild returned status 0x100 
    fcntl14   123  FAIL  :  testcase:19 FAILED 
    fcntl14   124  FAIL  :  First parent lock failed 
    fcntl14   125  FAIL  :  Test case 20, errno = 37 
    fcntl14   126  FAIL  :  Attempt to check lock status failed 
    fcntl14   127  FAIL  :  Test case 20, errno = 37 
    fcntl14   128  FAIL  :  SETLK: rc = -1, errno = 37, -1/EAGAIN or EACCES was expected 
    fcntl14   126  FAIL  :  Attempt to check lock status failed 
    fcntl14   127  FAIL  :  Test case 20, errno = 37 
    fcntl14   128  FAIL  :  SETLK: rc = -1, errno = 37, -1/EAGAIN or EACCES was expected 
    fcntl14   129  FAIL  :  Attempt to set child BLOCKING lock failed 
    fcntl14   130  FAIL  :  Test case 20, errno = 37 
    fcntl14   126  FAIL  :  tchild returned status 0x100 
    fcntl14   127  FAIL  :  testcase:20 FAILED 
    fcntl14   128  FAIL  :  First parent lock failed 
    fcntl14   129  FAIL  :  Test case 21, errno = 37 
    fcntl14   130  FAIL  :  Attempt to check lock status failed 
    fcntl14   131  FAIL  :  Test case 21, errno = 37 
    fcntl14   132  FAIL  :  SETLK: rc = -1, errno = 37, -1/EAGAIN or EACCES was expected 
    fcntl14   130  FAIL  :  Attempt to check lock status failed 
    fcntl14   131  FAIL  :  Test case 21, errno = 37 
    fcntl14   132  FAIL  :  SETLK: rc = -1, errno = 37, -1/EAGAIN or EACCES was expected 
    fcntl14   133  FAIL  :  Attempt to set child BLOCKING lock failed 
    fcntl14   134  FAIL  :  Test case 21, errno = 37 
    fcntl14   130  FAIL  :  tchild returned status 0x100 
    fcntl14   131  FAIL  :  testcase:21 FAILED 
    fcntl14   132  FAIL  :  First parent lock failed 
    fcntl14   133  FAIL  :  Test case 22, errno = 37 
    fcntl14   134  FAIL  :  Attempt to check lock status failed 
    fcntl14   135  FAIL  :  Test case 22, errno = 37 
    fcntl14   136  FAIL  :  SETLK: rc = -1, errno = 37, -1/EAGAIN or EACCES was expected 
    fcntl14   134  FAIL  :  Attempt to check lock status failed 
    fcntl14   135  FAIL  :  Test case 22, errno = 37 
    fcntl14   136  FAIL  :  SETLK: rc = -1, errno = 37, -1/EAGAIN or EACCES was expected 
    fcntl14   137  FAIL  :  Attempt to set child BLOCKING lock failed 
    fcntl14   138  FAIL  :  Test case 22, errno = 37 
    fcntl14   134  FAIL  :  tchild returned status 0x100 
    fcntl14   135  FAIL  :  testcase:22 FAILED 
    fcntl14   136  FAIL  :  First parent lock failed 
    fcntl14   137  FAIL  :  Test case 23, errno = 37 
    fcntl14   138  FAIL  :  Attempt to check lock status failed 
    fcntl14   139  FAIL  :  Test case 23, errno = 37 
    fcntl14   140  FAIL  :  Attempt to set child NONBLOCKING lock failed 
    fcntl14   141  FAIL  :  Test case 23, errno = 37 
    fcntl14   138  FAIL  :  tchild returned status 0x100 
    fcntl14   139  FAIL  :  testcase:23 FAILED 
    fcntl14   140  FAIL  :  First parent lock failed 
    fcntl14   141  FAIL  :  Test case 24, errno = 37 
    fcntl14   142  FAIL  :  Attempt to check lock status failed 
    fcntl14   143  FAIL  :  Test case 24, errno = 37 
    fcntl14   144  FAIL  :  SETLK: rc = -1, errno = 37, -1/EAGAIN or EACCES was expected 
    fcntl14   142  FAIL  :  Attempt to check lock status failed 
    fcntl14   143  FAIL  :  Test case 24, errno = 37 
    fcntl14   144  FAIL  :  SETLK: rc = -1, errno = 37, -1/EAGAIN or EACCES was expected 
    fcntl14   145  FAIL  :  Attempt to set child BLOCKING lock failed 
    fcntl14   146  FAIL  :  Test case 24, errno = 37 
    fcntl14   142  FAIL  :  tchild returned status 0x100 
    fcntl14   143  FAIL  :  testcase:24 FAILED 
    fcntl14   144  FAIL  :  First parent lock failed 
    fcntl14   145  FAIL  :  Test case 25, errno = 37 
    fcntl14   146  FAIL  :  Attempt to check lock status failed 
    fcntl14   147  FAIL  :  Test case 25, errno = 37 
    fcntl14   148  FAIL  :  Attempt to set child NONBLOCKING lock failed 
    fcntl14   149  FAIL  :  Test case 25, errno = 37 
    fcntl14   146  FAIL  :  tchild returned status 0x100 
    fcntl14   147  FAIL  :  testcase:25 FAILED 
    fcntl14   148  FAIL  :  First parent lock failed 
    fcntl14   149  FAIL  :  Test case 26, errno = 37 
    fcntl14   150  FAIL  :  Attempt to check lock status failed 
    fcntl14   151  FAIL  :  Test case 26, errno = 37 
    fcntl14   152  FAIL  :  Attempt to set child NONBLOCKING lock failed 
    fcntl14   153  FAIL  :  Test case 26, errno = 37 
    fcntl14   150  FAIL  :  tchild returned status 0x100 
    fcntl14   151  FAIL  :  testcase:26 FAILED 
    fcntl14   152  FAIL  :  First parent lock failed 
    fcntl14   153  FAIL  :  Test case 27, errno = 37 
    fcntl14   154  FAIL  :  Attempt to check lock status failed 
    fcntl14   155  FAIL  :  Test case 27, errno = 37 
    fcntl14   156  FAIL  :  Attempt to set child NONBLOCKING lock failed 
    fcntl14   157  FAIL  :  Test case 27, errno = 37 
    fcntl14   154  FAIL  :  tchild returned status 0x100 
    fcntl14   155  FAIL  :  testcase:27 FAILED 
    fcntl14   156  FAIL  :  First parent lock failed 
    fcntl14   157  FAIL  :  Test case 28, errno = 37 
    fcntl14   158  FAIL  :  Attempt to check lock status failed 
    fcntl14   159  FAIL  :  Test case 28, errno = 37 
    fcntl14   160  FAIL  :  Attempt to set child NONBLOCKING lock failed 
    fcntl14   161  FAIL  :  Test case 28, errno = 37 
    fcntl14   158  FAIL  :  tchild returned status 0x100 
    fcntl14   159  FAIL  :  testcase:28 FAILED 
    fcntl14   160  FAIL  :  First parent lock failed 
    fcntl14   161  FAIL  :  Test case 29, errno = 37 
    fcntl14   162  FAIL  :  Attempt to check lock status failed 
    fcntl14   163  FAIL  :  Test case 29, errno = 37 
    fcntl14   164  FAIL  :  Attempt to set child NONBLOCKING lock failed 
    fcntl14   165  FAIL  :  Test case 29, errno = 37 
    fcntl14   162  FAIL  :  tchild returned status 0x100 
    fcntl14   163  FAIL  :  testcase:29 FAILED 
    fcntl14   164  FAIL  :  First parent lock failed 
    fcntl14   165  FAIL  :  Test case 30, errno = 37 
    fcntl14   166  FAIL  :  Attempt to check lock status failed 
    fcntl14   167  FAIL  :  Test case 30, errno = 37 
    fcntl14   168  FAIL  :  Attempt to set child NONBLOCKING lock failed 
    fcntl14   169  FAIL  :  Test case 30, errno = 37 
    fcntl14   166  FAIL  :  tchild returned status 0x100 
    fcntl14   167  FAIL  :  testcase:30 FAILED 
    fcntl14   168  FAIL  :  First parent lock failed 
    fcntl14   169  FAIL  :  Test case 31, errno = 37 
    fcntl14   170  FAIL  :  Attempt to check lock status failed 
    fcntl14   171  FAIL  :  Test case 31, errno = 37 
    fcntl14   172  FAIL  :  Attempt to set child NONBLOCKING lock failed 
    fcntl14   173  FAIL  :  Test case 31, errno = 37 
    fcntl14   170  FAIL  :  tchild returned status 0x100 
    fcntl14   171  FAIL  :  testcase:31 FAILED 
    fcntl14   172  FAIL  :  First parent lock failed 
    fcntl14   173  FAIL  :  Test case 32, errno = 37 
    fcntl14   174  FAIL  :  Attempt to check lock status failed 
    fcntl14   175  FAIL  :  Test case 32, errno = 37 
    fcntl14   176  FAIL  :  Attempt to set child NONBLOCKING lock failed 
    fcntl14   177  FAIL  :  Test case 32, errno = 37 
    fcntl14   174  FAIL  :  tchild returned status 0x100 
    fcntl14   175  FAIL  :  testcase:32 FAILED 
    fcntl14   176  FAIL  :  First parent lock failed 
    fcntl14   177  FAIL  :  Test case 33, errno = 37 
    fcntl14   178  FAIL  :  Attempt to check lock status failed 
    fcntl14   179  FAIL  :  Test case 33, errno = 37 
    fcntl14   180  FAIL  :  SETLK: rc = -1, errno = 37, -1/EAGAIN or EACCES was expected 
    fcntl14   178  FAIL  :  Attempt to check lock status failed 
    fcntl14   179  FAIL  :  Test case 33, errno = 37 
    fcntl14   180  FAIL  :  SETLK: rc = -1, errno = 37, -1/EAGAIN or EACCES was expected 
    fcntl14   181  FAIL  :  Attempt to set child BLOCKING lock failed 
    fcntl14   182  FAIL  :  Test case 33, errno = 37 
    fcntl14   178  FAIL  :  tchild returned status 0x100 
    fcntl14   179  FAIL  :  testcase:33 FAILED 
    fcntl14   180  FAIL  :  First parent lock failed 
    fcntl14   181  FAIL  :  Test case 34, errno = 37 
    fcntl14   182  FAIL  :  Attempt to check lock status failed 
    fcntl14   183  FAIL  :  Test case 34, errno = 37 
    fcntl14   184  FAIL  :  SETLK: rc = -1, errno = 37, -1/EAGAIN or EACCES was expected 
    fcntl14   182  FAIL  :  Attempt to check lock status failed 
    fcntl14   183  FAIL  :  Test case 34, errno = 37 
    fcntl14   184  FAIL  :  SETLK: rc = -1, errno = 37, -1/EAGAIN or EACCES was expected 
    fcntl14   185  FAIL  :  Attempt to set child BLOCKING lock failed 
    fcntl14   186  FAIL  :  Test case 34, errno = 37 
    fcntl14   182  FAIL  :  tchild returned status 0x100 
    fcntl14   183  FAIL  :  testcase:34 FAILED 
    fcntl14   184  FAIL  :  First parent lock failed 
    fcntl14   185  FAIL  :  Test case 35, errno = 37 
    fcntl14   186  FAIL  :  Attempt to check lock status failed 
    fcntl14   187  FAIL  :  Test case 35, errno = 37 
    fcntl14   188  FAIL  :  Attempt to set child NONBLOCKING lock failed 
    fcntl14   189  FAIL  :  Test case 35, errno = 37 
    fcntl14   186  FAIL  :  tchild returned status 0x100 
    fcntl14   187  FAIL  :  testcase:35 FAILED 
    fcntl14   188  FAIL  :  First parent lock failed 
    fcntl14   189  FAIL  :  Test case 36, errno = 37 
    fcntl14   190  FAIL  :  Attempt to check lock status failed 
    fcntl14   191  FAIL  :  Test case 36, errno = 37 
    fcntl14   192  FAIL  :  SETLK: rc = -1, errno = 37, -1/EAGAIN or EACCES was expected 
    fcntl14   190  FAIL  :  Attempt to check lock status failed 
    fcntl14   191  FAIL  :  Test case 36, errno = 37 
    fcntl14   192  FAIL  :  SETLK: rc = -1, errno = 37, -1/EAGAIN or EACCES was expected 
    fcntl14   193  FAIL  :  Attempt to set child BLOCKING lock failed 
    fcntl14   194  FAIL  :  Test case 36, errno = 37 
    fcntl14   190  FAIL  :  tchild returned status 0x100 
    fcntl14   191  FAIL  :  testcase:36 FAILED 
    fcntl14   192  FAIL  :  Block 2, test 1 FAILED 
    fcntl14   193  FAIL  :  First parent lock failed 
    fcntl14   194  FAIL  :  Test case 37, errno = 37 
    fcntl14   195  FAIL  :  Attempt to check lock status failed 
    fcntl14   196  FAIL  :  Test case 37, errno = 37 
    fcntl14   197  FAIL  :  Attempt to set child NONBLOCKING lock failed 
    fcntl14   198  FAIL  :  Test case 37, errno = 37 
    fcntl14   195  FAIL  :  tchild returned status 0x100 
    fcntl14   196  FAIL  :  testcase:37 FAILED 
    fcntl14   197  FAIL  :  First parent lock failed 
    fcntl14   198  FAIL  :  Test case 38, errno = 37 
    fcntl14   199  FAIL  :  Attempt to check lock status failed 
    fcntl14   200  FAIL  :  Test case 38, errno = 37 
    fcntl14   201  FAIL  :  Attempt to set child NONBLOCKING lock failed 
    fcntl14   202  FAIL  :  Test case 38, errno = 37 
    fcntl14   199  FAIL  :  tchild returned status 0x100 
    fcntl14   200  FAIL  :  testcase:38 FAILED 
    fcntl14   201  FAIL  :  First parent lock failed 
    fcntl14   202  FAIL  :  Test case 39, errno = 37 
    fcntl14   203  FAIL  :  Attempt to check lock status failed 
    fcntl14   204  FAIL  :  Test case 39, errno = 37 
    fcntl14   205  FAIL  :  SETLK: rc = -1, errno = 37, -1/EAGAIN or EACCES was expected 
    fcntl14   203  FAIL  :  Attempt to check lock status failed 
    fcntl14   204  FAIL  :  Test case 39, errno = 37 
    fcntl14   205  FAIL  :  SETLK: rc = -1, errno = 37, -1/EAGAIN or EACCES was expected 
    fcntl14   206  FAIL  :  Attempt to set child BLOCKING lock failed 
    fcntl14   207  FAIL  :  Test case 39, errno = 37 
    fcntl14   203  FAIL  :  tchild returned status 0x100 
    fcntl14   204  FAIL  :  testcase:39 FAILED 
    fcntl14   205  FAIL  :  First parent lock failed 
    fcntl14   206  FAIL  :  Test case 40, errno = 37 
    fcntl14   207  FAIL  :  Attempt to check lock status failed 
    fcntl14   208  FAIL  :  Test case 40, errno = 37 
    fcntl14   209  FAIL  :  SETLK: rc = -1, errno = 37, -1/EAGAIN or EACCES was expected 
    fcntl14   207  FAIL  :  Attempt to check lock status failed 
    fcntl14   208  FAIL  :  Test case 40, errno = 37 
    fcntl14   209  FAIL  :  SETLK: rc = -1, errno = 37, -1/EAGAIN or EACCES was expected 
    fcntl14   210  FAIL  :  Attempt to set child BLOCKING lock failed 
    fcntl14   211  FAIL  :  Test case 40, errno = 37 
    fcntl14   207  FAIL  :  tchild returned status 0x100 
    fcntl14   208  FAIL  :  testcase:40 FAILED 
    fcntl14   209  FAIL  :  First parent lock failed 
    fcntl14   210  FAIL  :  Test case 41, errno = 37 
    fcntl14   211  FAIL  :  Attempt to check lock status failed 
    fcntl14   212  FAIL  :  Test case 41, errno = 37 
    fcntl14   213  FAIL  :  Attempt to set child NONBLOCKING lock failed 
    fcntl14   214  FAIL  :  Test case 41, errno = 37 
    fcntl14   211  FAIL  :  tchild returned status 0x100 
    fcntl14   212  FAIL  :  testcase:41 FAILED 
    fcntl14   213  FAIL  :  First parent lock failed 
    fcntl14   214  FAIL  :  Test case 42, errno = 37 
    fcntl14   215  FAIL  :  Attempt to check lock status failed 
    fcntl14   216  FAIL  :  Test case 42, errno = 37 
    fcntl14   217  FAIL  :  Attempt to set child NONBLOCKING lock failed 
    fcntl14   218  FAIL  :  Test case 42, errno = 37 
    fcntl14   215  FAIL  :  tchild returned status 0x100 
    fcntl14   216  FAIL  :  testcase:42 FAILED 
    fcntl14   217  FAIL  :  First parent lock failed 
    fcntl14   218  FAIL  :  Test case 43, errno = 37 
    fcntl14   219  FAIL  :  Attempt to check lock status failed 
    fcntl14   220  FAIL  :  Test case 43, errno = 37 
    fcntl14   221  FAIL  :  SETLK: rc = -1, errno = 37, -1/EAGAIN or EACCES was expected 
    fcntl14   219  FAIL  :  Attempt to check lock status failed 
    fcntl14   220  FAIL  :  Test case 43, errno = 37 
    fcntl14   221  FAIL  :  SETLK: rc = -1, errno = 37, -1/EAGAIN or EACCES was expected 
    fcntl14   222  FAIL  :  Attempt to set child BLOCKING lock failed 
    fcntl14   223  FAIL  :  Test case 43, errno = 37 
    fcntl14   219  FAIL  :  tchild returned status 0x100 
    fcntl14   220  FAIL  :  testcase:43 FAILED 
    fcntl14   221  FAIL  :  First parent lock failed 
    fcntl14   222  FAIL  :  Test case 44, errno = 37 
    fcntl14   223  FAIL  :  Attempt to check lock status failed 
    fcntl14   224  FAIL  :  Test case 44, errno = 37 
    fcntl14   225  FAIL  :  SETLK: rc = -1, errno = 37, -1/EAGAIN or EACCES was expected 
    fcntl14   223  FAIL  :  Attempt to check lock status failed 
    fcntl14   224  FAIL  :  Test case 44, errno = 37 
    fcntl14   225  FAIL  :  SETLK: rc = -1, errno = 37, -1/EAGAIN or EACCES was expected 
    fcntl14   226  FAIL  :  Attempt to set child BLOCKING lock failed 
    fcntl14   227  FAIL  :  Test case 44, errno = 37 
    fcntl14   223  FAIL  :  tchild returned status 0x100 
    fcntl14   224  FAIL  :  testcase:44 FAILED 
    fcntl14   225  FAIL  :  First parent lock failed 
    fcntl14   226  FAIL  :  Test case 45, errno = 37 
    fcntl14   227  FAIL  :  Attempt to check lock status failed 
    fcntl14   228  FAIL  :  Test case 45, errno = 37 
    fcntl14   229  FAIL  :  SETLK: rc = -1, errno = 37, -1/EAGAIN or EACCES was expected 
    fcntl14   227  FAIL  :  Attempt to check lock status failed 
    fcntl14   228  FAIL  :  Test case 45, errno = 37 
    fcntl14   229  FAIL  :  SETLK: rc = -1, errno = 37, -1/EAGAIN or EACCES was expected 
    fcntl14   230  FAIL  :  Attempt to set child BLOCKING lock failed 
    fcntl14   231  FAIL  :  Test case 45, errno = 37 
    fcntl14   227  FAIL  :  tchild returned status 0x100 
    fcntl14   228  FAIL  :  testcase:45 FAILED 
    fcntl14   229  FAIL  :  Block 2, test 2 FAILED 
    fcntl14     0  INFO  :  Exit block 2 
    fcntl14     0  INFO  :  Enter block 3 
    fcntl14     0  INFO  :  Test with mandatory locking PASSED 
    fcntl14     0  INFO  :  Exit block 3 
    fcntl14     0  INFO  :  Enter block 4 
    fcntl14   227  FAIL  :  tchild returned status 0x100 
    fcntl14   228  FAIL  :  testcase:45 FAILED 
    fcntl14   229  FAIL  :  Block 2, test 2 FAILED 
    fcntl14     0  INFO  :  Exit block 2 
    fcntl14     0  INFO  :  Enter block 3 
    fcntl14     0  INFO  :  Test with mandatory locking PASSED 
    fcntl14     0  INFO  :  Exit block 3 
    fcntl14     0  INFO  :  Enter block 4 
    fcntl14   227  FAIL  :  tchild returned status 0x100 
    fcntl14   228  FAIL  :  testcase:45 FAILED 
    fcntl14   229  FAIL  :  Block 2, test 2 FAILED 
    fcntl14     0  INFO  :  Exit block 2 
    fcntl14     0  INFO  :  Enter block 3 
    fcntl14     0  INFO  :  Test with mandatory locking PASSED 
    fcntl14     0  INFO  :  Exit block 3 
    fcntl14     0  INFO  :  Enter block 4 
    fcntl14     0  INFO  :  Test of locks on file PASSED 
    fcntl14     0  INFO  :  Exit block 4 
    

    10

    exited

    1

    no

    2

    90

    4

    fcntl23

    Thu Mar 27 12:35:55 2008

    "fcntl23"

    ""

    exit

    "ok"

    fcntl23     1  FAIL  :  fcntl(tfile_4277, F_SETLEASE,F_RDLCK) Failed, errno=22 : Invalid argument 
    

    0

    exited

    1

    no

    0

    0

    5

    fcntl24

    Thu Mar 27 12:35:55 2008

    "fcntl24"

    ""

    exit

    "ok"

    fcntl24     1  FAIL  :  fcntl(tfile_4278, F_SETLEASE,F_WRLCK) Failed, errno=22 : Invalid argument 
    

    0

    exited

    1

    no

    0

    1

    6

    fcntl25

    Thu Mar 27 12:35:55 2008

    "fcntl25"

    ""

    exit

    "ok"

    fcntl25     1  FAIL  :  fcntl(tfile_4279, F_SETLEASE,F_WRLCK) Failed, errno=22 : Invalid argument 
    

    0

    exited

    1

    no

    0

    0

    7

    fcntl26

    Thu Mar 27 12:35:55 2008

    "fcntl26 "

    ""

    exit

    "ok"

    fcntl26     1  FAIL  :  fcntl(tfile_4280, F_SETLEASE,F_WRLCK) Failed, errno=22 : Invalid argument 
    

    0

    exited

    1

    no

    0

    1

    8

    splice01

    Thu Mar 27 12:35:55 2008

    "splice01"

    ""

    exit

    "ok"

    splice01    1  FAIL  :  splice() Failed, errno=22 : Invalid argument 
    

    0

    exited

    1

    no

    0

    0

    9

    tee01

    Thu Mar 27 12:35:55 2008

    "tee01"

    ""

    exit

    "ok"

    tee01       1  FAIL  :  tee() Failed, errno=22 : Invalid argument 
    

    0

    exited

    1

    no

    0

    1

    10

    utime01

    Thu Mar 27 12:35:55 2008

    "utime01"

    ""

    exit

    "ok"

    utime01     1  FAIL  :  tmp_file access and modification times not set 
    

    5

    exited

    1

    no

    0

    0

    11

    utime02

    Thu Mar 27 12:36:00 2008

    "utime02"

    ""

    exit

    "ok"

    utime02     1  FAIL  :  tmp_file access and modification times not set 
    

    4

    exited

    1

    no

    0

    1

    12

    utime03

    Thu Mar 27 12:36:04 2008

    "utime03"

    ""

    exit

    "ok"

    utime03     1  FAIL  :  tmp_file access and modification times not set 
    

    4

    exited

    0

    no

    1

    1

    13

    nfs01

    Thu Mar 27 12:36:08 2008

    "export VERSION

    ""

    exit

    "ok"

     
    Test Options: 
     VERSION: 2 
     RHOST: cell21b.ltc.austin.ibm.com 
     NFILES: 1000 
     SOCKET_TYPE: udp 
     NFS_TYPE: nfs 
     TESTDIR: /tmp/nfs014288.testdir 
    Setting up remote machine: cell21b.ltc.austin.ibm.com 
    connect to address 9.3.190.28 port 544: Connection refused 
    connect to address 9.3.190.28 port 544: Connection refused 
    trying normal rsh (/usr/bin/rsh) 
    cell21b.ltc.austin.ibm.com: Connection refused 
    Cleaning up testcase 
    mount: mount to NFS server 'cell21b.ltc.austin.ibm.com' failed: RPC Error: Program not registered. 
    Cannot mount /root/ltp-intermediate-21032008/testcases/network/nfs/nfs01/nfs014288 
    umount: /root/ltp-intermediate-21032008/testcases/network/nfs/nfs01/nfs014288: not mounted 
    Cannot umount /root/ltp-intermediate-21032008/testcases/network/nfs/nfs01/nfs014288 
    connect to address 9.3.190.28 port 544: Connection refused 
    connect to address 9.3.190.28 port 544: Connection refused 
    trying normal rsh (/usr/bin/rsh) 
    cell21b.ltc.austin.ibm.com: Connection refused 
    connect to address 9.3.190.28 port 544: Connection refused 
    connect to address 9.3.190.28 port 544: Connection refused 
    trying normal rsh (/usr/bin/rsh) 
    cell21b.ltc.austin.ibm.com: Connection refused 
    Test Failed: Could not create remote directory 
    

    93

    exited

    1

    no

    3

    11

    14

    vmsplice01

    Thu Mar 27 12:37:41 2008

    "vmsplice01"

    ""

    exit

    "ok"

    vmsplice01    1  FAIL  :  vmsplice() Failed, errno=22 : Invalid argument 
    incrementing stop 
    

    1

    exited

    1

    no

    1

    0

    Summary Report

    Test Summary

    Pan reported some Tests FAIL

    LTP Version LTP-20080229
    Start Time Thu Mar 27 12:33:27 CDT 2008
    End Time Thu Mar 27 12:37:42 CDT 2008
    Log Result /root/ltp-intermediate-21032008/results
    Output/Failed Result /root/ltp-intermediate-21032008/output
    Total Tests14
    Total Failures 13
    Kernel Version2.6.18-85.el5
    Machine Architecture ppc64
    Hostname Sniff