#18 compile failure.

closed-fixed
None
5
2005-03-24
2004-10-19
Robin Cook
No

Getting this error when trying to compile 0.6.11.
0.6.10 compiles without error.

make[3]: Leaving directory `/usr/src/libexif-0.6.11/test'
Making all in po
make[3]: Entering directory `/usr/src/libexif-0.6.11/po'
make[3]: *** No rule to make target `all'. Stop.
make[3]: Leaving directory `/usr/src/libexif-0.6.11/po'
make[2]: Leaving directory `/usr/src/libexif-0.6.11'
make[2]: *** [all-recursive] Error 1
make[1]: Leaving directory `/usr/src/libexif-0.6.11'
make[1]: *** [all] Error 2

Discussion

1 2 > >> (Page 1 of 2)
  • Logged In: YES
    user_id=853280

    I have the same compile Problem.

     
  • Chuck R. Bell
    Chuck R. Bell
    2004-12-06

    Logged In: YES
    user_id=332799

    I am having this same problem and I tried this patch but
    still get the same error.

    Any help appreciated.

    Chuck
    -------------
    Slackware 10.x-current
    Linux-2.6.9
    gcc-3.3.4

     
  • Logged In: YES
    user_id=853280

    After the patch of configure.in use this commands to create
    new configure

    aclocal -I m4
    autoconf
    automake

     
  • Logged In: YES
    user_id=853280

    After the patch of configure.in use this commands to create
    new configure

    aclocal -I m4
    autoconf
    automake

     
  • Chuck R. Bell
    Chuck R. Bell
    2004-12-11

    Logged In: YES
    user_id=332799

    > Henschel

    That fixed it.

    Thanks!

    Chuck

     
  • Rui Maciel
    Rui Maciel
    2005-01-18

    Logged In: YES
    user_id=631203

    Forgive my ignorance but how do I apply that patch? I am a
    total newbie in this diff patch business :|

     
  • Alejandro Mery
    Alejandro Mery
    2005-02-28

    Logged In: YES
    user_id=996489

    not that easy, autogen doesn't work with recient auto{conf,make}

    # aclocal
    /usr/share/aclocal/pth.m4:43: warning: underquoted
    definition of _AC_PTH_ERROR
    run info '(automake)Extending aclocal'
    or see
    http://sources.redhat.com/automake/automake.html#Extending-aclocal
    /usr/share/aclocal/pth.m4:54: warning: underquoted
    definition of _AC_PTH_VERBOSE
    /usr/share/aclocal/pth.m4:60: warning: underquoted
    definition of AC_CHECK_PTH
    /usr/share/aclocal/audiofile.m4:12: warning: underquoted
    definition of AM_PATH_AUDIOFILE
    # automake
    Makefile.am:1: AM_GNU_GETTEXT used but `intl' not in SUBDIRS
    # autoconf
    configure.in:30: error: possibly undefined macro:
    AC_NEED_STDINT_H
    If this token and others are legitimate, please use
    m4_pattern_allow.
    See the Autoconf documentation.

     
  • Logged In: YES
    user_id=59853

    should be fixed with 0.6.12 of today of 0.6.13 (to be
    released shortly)

     
    • assigned_to: nobody --> hun
    • status: open --> closed
     
1 2 > >> (Page 1 of 2)