kxicq2-0.7.6 : Compiling Error

Help
2002-08-14
2002-09-29
  • I'm trying to compile a kxicq2-0.7.6 on a KDE-3.0.1 using qt-3.0.4.
    The ./configure works as it should do (when i set the "--with-qt-dir="-option manually)
    Make doesn't work that good.

    Below are the last few lines of the make-output:

    Making all in kxicq
    make[2]: Entering directory `/home/philipp/download/ICQ/kxicq2-0.7.6/kxicq'
    Making all in ui
    make[3]: Entering directory `/home/philipp/download/ICQ/kxicq2-0.7.6/kxicq/ui'
    g++ -I. -I. -I../.. -I/opt/kde3/include -I/usr/lib/qt-3.0.4/include/ -I/usr/X11R6/include               -I../../icons/icq  -I../../kxicq            -I../../kxicq/wm                -I../../kxicq/ui                -I../../kxicq/engine            -I../../kxicq/widgets               -I../../kxicq/widgets/checklistbox  -DQT_THREAD_SUPPORT  -D_REENTRANT  -g -O2 -Wall   -c kxinfo_extra.cpp
    kxinfo_extra.cpp: In method `kxInfoExtra::kxInfoExtra(QWidget * = 0, const char * = 0, unsigned int = 0)':
    kxinfo_extra.cpp:71: no matching function for call to `QSpinBox::setMidLineWidth (int)'
    make[3]: *** [kxinfo_extra.o] Error 1
    make[3]: Leaving directory `/home/philipp/download/ICQ/kxicq2-0.7.6/kxicq/ui'
    make[2]: *** [all-recursive] Error 1
    make[2]: Leaving directory `/home/philipp/download/ICQ/kxicq2-0.7.6/kxicq'
    make[1]: *** [all-recursive] Error 1
    make[1]: Leaving directory `/home/philipp/download/ICQ/kxicq2-0.7.6'
    make: *** [all-recursive-am] Error 2

    Does anybody have an idea what's wrong with it?

    thx a lot
    Pocytac

     

    • Anonymous
      2002-09-29

      i have exactly the same error .. i did everything well ... i dunno what's wrong.