Hi,

I'm using KFS with Hypertable 0.9.3.1 release.

Now  I'm trying to compile KFS 0.4 on OPEN SUSE 11.2.

  After gmake the following error appears:

  In file included from /home/mmarinov/kfs/src/cc/common/properties.cc:30:
 /home/mmarinov/kfs/src/cc/common/properties.h:54: error: ‘uint64_t’ does
 not name a type
 /home/mmarinov/kfs/src/cc/common/properties.cc:143: error: ‘uint64_t’
does
 not name a type
 gmake[2]: *** [src/cc/common/CMakeFiles/kfsCommon.dir/propertieso] Error 1
 gmake[1]: *** [src/cc/common/CMakeFiles/kfsCommon.dir/all] Error 2
 gmake: *** [all] Error 2

  Could you help me?

  I have compiled kfs 0.4 on Suse 11.0 and CentOS 5.4 - no problems.
It works perfect with Hypertable 0.9.3.1

Regards,

Milko

**********************************************************
     Assoc. Prof. Milko Todorov Marinov, PhD
 Department of Computer Systems & Technologies
                University of Ruse
8 Studentska Str, 7017 Ruse, BULGARIA
Tel. (+359 82) 888 356, Fax. (+359 82) 845 708
Cell phone: (+359 88) 999 6793
E-mail: MMarinov@ecs.uni-ruse.bg
***********************************************************