#1 make failed

open
nobody
5
2006-09-02
2006-08-29
Anonymous
No

Hello,

I am on SuSE 9.3 and tried to install projectmanager.

But make failed with the following output:

Making all in src
make[2]: Entering directory
`/root/AddOns/projectmanager/src'
/usr/lib/qt3/bin/moc ./plugin_projectmanager.h -o
plugin_projectmanager.moc
if /bin/sh ../libtool --silent --tag=CXX
--mode=compile g++ -DHAVE_CONFIG_H -I. -I. -I..
-I/opt/kde3/include -I/usr/lib/qt3/include
-I/usr/X11R6/include -DQT_THREAD_SUPPORT
-D_REENTRANT -Wno-long-long -Wundef -ansi
-D_XOPEN_SOURCE=500 -D_BSD_SOURCE -Wcast-align
-Wconversion -Wchar-subscripts -Wall -W
-Wpointer-arith -O2 -Wformat-security
-Wmissing-format-attribute -Wno-non-virtual-dtor
-fno-exceptions -fno-check-new -fno-common -MT
plugin_projectmanager.lo -MD -MP -MF
".deps/plugin_projectmanager.Tpo" -c -o
plugin_projectmanager.lo plugin_projectmanager.cpp; \
then mv -f ".deps/plugin_projectmanager.Tpo"
".deps/plugin_projectmanager.Plo"; else rm -f
".deps/plugin_projectmanager.Tpo"; exit 1; fi
plugin_projectmanager.cpp: In member function
`virtual void

KatePluginProjectManager::addView(Kate::MainWindow*)':
plugin_projectmanager.cpp:91: error: `createToolView'
undeclared (first use
this function)
plugin_projectmanager.cpp:91: error: (Each undeclared
identifier is reported
only once for each function it appears in.)
make[2]: *** [plugin_projectmanager.lo] Error 1
make[2]: Leaving directory
`/root/AddOns/projectmanager/src'
make[1]: *** [all-recursive] Error 1
make[1]: Leaving directory
`/root/AddOns/projectmanager'
make: *** [all] Error 2

Regards,
Uwe

Discussion

  • lynx
    lynx
    2006-09-02

    Logged In: YES
    user_id=1555922

    compiles fine over here, maybe you are missing some -devel
    packages. check the installation of kdebase3-devel,
    kdelibs3-devel and qt3-devel.

    greets,
    fishdude

     
  • lynx
    lynx
    2006-09-02

    • status: open --> pending
     
  • lynx
    lynx
    2006-09-02

    • status: pending --> open