hi all, when trying to create a new image for the connex i end up in this error:

Making all in glob
make[3]: Entering directory `/home/jasch/gumstix-buildroot/build_arm_nofpu/make-3.80/glob'
make[3]: Nothing to be done for `all'.
make[3]: Leaving directory `/home/jasch/gumstix-buildroot/build_arm_nofpu/make-3.80/glob'
Making all in config
make[3]: Entering directory `/home/jasch/gumstix-buildroot/build_arm_nofpu/make-3.80/config'
make[3]: Nothing to be done for `all'.
make[3]: Leaving directory `/home/jasch/gumstix-buildroot/build_arm_nofpu/make-3.80/config'
Making all in po
make[3]: Entering directory `/home/jasch/gumstix-buildroot/build_arm_nofpu/make- 3.80/po'
make[3]: Nothing to be done for `all'.
make[3]: Leaving directory `/home/jasch/gumstix-buildroot/build_arm_nofpu/make-3.80/po'
Making all in doc
make[3]: Entering directory `/home/jasch/gumstix-buildroot/build_arm_nofpu/make- 3.80/doc'
make[3]: Nothing to be done for `all'.
make[3]: Leaving directory `/home/jasch/gumstix-buildroot/build_arm_nofpu/make-3.80/doc'
make[3]: Entering directory `/home/jasch/gumstix-buildroot/build_arm_nofpu/make- 3.80'
if /home/jasch/gumstix-buildroot/build_arm_nofpu/staging_dir/bin/arm-linux-uclibcgnueabi-gcc -DLOCALEDIR=\"/usr/share/locale\" -DLIBDIR=\"/usr/lib\" -DINCLUDEDIR=\"/usr/include\" -DHAVE_CONFIG_H -I
. -I. -I.     -pipe -Os -march=armv5te -mtune=xscale -Wa,-mcpu=xscale  -MT ar.o -MD -MP -MF ".deps/ar.Tpo" \
          -c -o ar.o `test -f 'ar.c' || echo './'`ar.c; \
        then mv ".deps/ar.Tpo" ".deps/ar.Po"; \
        else rm -f ".deps/ar.Tpo"; exit 1; \
        fi
if /home/jasch/gumstix-buildroot/build_arm_nofpu/staging_dir/bin/arm-linux-uclibcgnueabi-gcc -DLOCALEDIR=\"/usr/share/locale\" -DLIBDIR=\"/usr/lib\" -DINCLUDEDIR=\"/usr/include\" -DHAVE_CONFIG_H -I
. -I. -I.     -pipe -Os -march=armv5te -mtune=xscale -Wa,-mcpu=xscale  -MT arscan.o -MD -MP -MF ".deps/arscan.Tpo" \
          -c -o arscan.o `test -f 'arscan.c' || echo './'`arscan.c; \
        then mv ".deps/arscan.Tpo" ".deps/arscan.Po"; \
        else rm -f ".deps/arscan.Tpo"; exit 1; \
        fi
if /home/jasch/gumstix-buildroot/build_arm_nofpu/staging_dir/bin/arm-linux-uclibcgnueabi-gcc -DLOCALEDIR=\"/usr/share/locale\" -DLIBDIR=\"/usr/lib\" -DINCLUDEDIR=\"/usr/include\" -DHAVE_CONFIG_H -I
. -I. -I.     -pipe -Os -march=armv5te -mtune=xscale -Wa,-mcpu=xscale  -MT commands.o -MD -MP -MF ".deps/commands.Tpo" \
          -c -o commands.o `test -f 'commands.c' || echo './'`commands.c; \
        then mv ".deps/commands.Tpo" ".deps/commands.Po"; \
        else rm -f ".deps/commands.Tpo"; exit 1; \
        fi
if /home/jasch/gumstix-buildroot/build_arm_nofpu/staging_dir/bin/arm-linux-uclibcgnueabi-gcc -DLOCALEDIR=\"/usr/share/locale\" -DLIBDIR=\"/usr/lib\" -DINCLUDEDIR=\"/usr/include\" -DHAVE_CONFIG_H -I
. -I. -I.     -pipe -Os -march=armv5te -mtune=xscale -Wa,-mcpu=xscale  -MT default.o -MD -MP -MF ".deps/default.Tpo" \
          -c -o default.o `test -f 'default.c' || echo './'`default.c; \
        then mv ".deps/default.Tpo" ".deps/default.Po"; \
        else rm -f ".deps/default.Tpo"; exit 1; \
        fi
if /home/jasch/gumstix-buildroot/build_arm_nofpu/staging_dir/bin/arm-linux-uclibcgnueabi-gcc -DLOCALEDIR=\"/usr/share/locale\" -DLIBDIR=\"/usr/lib\" -DINCLUDEDIR=\"/usr/include\" -DHAVE_CONFIG_H -I
. -I. -I.     -pipe -Os -march=armv5te -mtune=xscale -Wa,-mcpu=xscale  -MT dir.o -MD -MP -MF ".deps/dir.Tpo" \
          -c -o dir.o `test -f 'dir.c' || echo './'`dir.c; \
        then mv ".deps/dir.Tpo" ".deps/dir.Po"; \
        else rm -f ".deps/dir.Tpo"; exit 1; \
        fi
if /home/jasch/gumstix-buildroot/build_arm_nofpu/staging_dir/bin/arm-linux-uclibcgnueabi-gcc -DLOCALEDIR=\"/usr/share/locale\" -DLIBDIR=\"/usr/lib\" -DINCLUDEDIR=\"/usr/include\" -DHAVE_CONFIG_H -I
. -I. -I.     -pipe -Os -march=armv5te -mtune=xscale -Wa,-mcpu=xscale  -MT expand.o -MD -MP -MF ".deps/expand.Tpo" \
          -c -o expand.o `test -f 'expand.c' || echo './'`expand.c; \
        then mv ".deps/expand.Tpo" ".deps/expand.Po"; \
        else rm -f ".deps/expand.Tpo"; exit 1; \
        fi
if /home/jasch/gumstix-buildroot/build_arm_nofpu/staging_dir/bin/arm-linux-uclibcgnueabi-gcc -DLOCALEDIR=\"/usr/share/locale\" -DLIBDIR=\"/usr/lib\" -DINCLUDEDIR=\"/usr/include\" -DHAVE_CONFIG_H -I
. -I. -I.     -pipe -Os -march=armv5te -mtune=xscale -Wa,-mcpu=xscale  -MT file.o -MD -MP -MF ".deps/file.Tpo" \
          -c -o file.o `test -f 'file.c' || echo './'`file.c; \
        then mv ".deps/file.Tpo" ".deps/file.Po"; \
        else rm -f ".deps/file.Tpo"; exit 1; \
        fi
dir.c: In function 'dir_setup_glob':
dir.c:1197: error: 'glob_t' has no member named 'gl_opendir'
dir.c:1198: error: 'glob_t' has no member named 'gl_readdir'
dir.c:1199: error: 'glob_t' has no member named 'gl_closedir'
dir.c:1200: error: 'glob_t' has no member named 'gl_stat'
make[3]: *** [dir.o] Error 1
make[3]: *** Waiting for unfinished jobs....
make[3]: Leaving directory `/home/jasch/gumstix-buildroot/build_arm_nofpu/make-3.80'
make[2]: *** [all-recursive] Error 1
make[2]: Leaving directory `/home/jasch/gumstix-buildroot/build_arm_nofpu/make-3.80'
make[1]: *** [all] Error 2
make[1]: Leaving directory `/home/jasch/gumstix-buildroot/build_arm_nofpu/make-3.80'
make: *** [/home/jasch/gumstix-buildroot/build_arm_nofpu/make-3.80/make] Error 2
root@dellbook :/home/jasch/gumstix-buildroot#

any ideas on what i might be missing?

thanks,

/alejo