Good day all,

I am having errors while trying to build the image "$ bitbake omap3-console-image".

These are the errors:

collect2: ld returned 1 exit status
| make[2]: *** [link_app.gnu] Error 1
| make[2]: Leaving directory `/home/nganpet/overo-oe/tmp/work/i686-linux/openssl-native-1.0.0d-r14.0/openssl-1.0.0d/apps'
| make[1]: *** [openssl] Error 2
| make[1]: Leaving directory `/home/nganpet/overo-oe/tmp/work/i686-linux/openssl-native-1.0.0d-r14.0/openssl-1.0.0d/apps'
| make: *** [build_apps] Error 1
| + die 'oe_runmake failed'
| + oefatal 'oe_runmake failed'
| + echo FATAL: 'oe_runmake failed'
| FATAL: oe_runmake failed
| + exit 1
NOTE: package openssl-native-1.0.0d-r14.0: task do_compile: Failed
ERROR: Function 'do_compile' failed (see /home/nganpet/overo-oe/tmp/work/i686-linux/openssl-native-1.0.0d-r14.0/temp/log.do_compile.15985 for further information)
ERROR: Task 2502 (/home/nganpet/overo-oe/org.openembedded.dev/recipes/openssl/openssl-native_1.0.0d.bb, do_compile) failed with exit code '1'
ERROR: '/home/nganpet/overo-oe/org.openembedded.dev/recipes/openssl/openssl-native_1.0.0d.bb' failed
nganpet@nganpet-PROLINE-DQ35JOE:~$
 
Any help please,
Gutembert.