NOTE: Running task 472 of 672 (ID: 9, /home/coolaj86/overo-oe/org.openembedded.dev/recipes/aufs/aufs2-util_git.bb, do_compile)
ERROR: function do_compile failed
ERROR: log data follows (/home/coolaj86/overo-oe/tmp/work/overo-angstrom-linux-gnueabi/aufs2-util-git-r1/temp/log.do_compile.21597)
| c2tmac.c:21:29: error: linux/aufs_type.h: No such file or directory
| c2tmac.c: In function 'main':
| c2tmac.c:29: error: 'AUFS_VERSION' undeclared (first use in this function)
| c2tmac.c:29: error: (Each undeclared identifier is reported only once
| c2tmac.c:29: error: for each function it appears in.)
| c2tmac.c:30: error: 'AUFS_XINO_FNAME' undeclared (first use in this function)
| c2tmac.c:31: error: 'AUFS_XINO_DEFPATH' undeclared (first use in this function)
| c2tmac.c:32: error: 'AUFS_DIRWH_DEF' undeclared (first use in this function)
| c2tmac.c:33: error: 'AUFS_WH_PFX' undeclared (first use in this function)
| c2tmac.c:34: error: 'AUFS_WH_PFX_LEN' undeclared (first use in this function)
| c2tmac.c:35: error: 'AUFS_WKQ_NAME' undeclared (first use in this function)
| c2tmac.c:36: error: 'AUFS_NWKQ_DEF' undeclared (first use in this function)
| c2tmac.c:37: error: 'AUFS_WH_DIROPQ' undeclared (first use in this function)
| c2tmac.c:38: error: 'AUFS_WH_BASE' undeclared (first use in this function)
| c2tmac.c:39: error: 'AUFS_WH_PLINKDIR' undeclared (first use in this function)
| c2tmac.c:40: error: 'AUFS_MFS_SECOND_DEF' undeclared (first use in this function)
| c2tmac.c:41: error: 'AUFS_RDBLK_DEF' undeclared (first use in this function)
| c2tmac.c:42: error: 'AUFS_RDHASH_DEF' undeclared (first use in this function)
NOTE: Task failed: /home/coolaj86/overo-oe/tmp/work/overo-angstrom-linux-gnueabi/aufs2-util-git-r1/temp/log.do_compile.21597
ERROR: TaskFailed event exception, aborting
ERROR: Build of /home/coolaj86/overo-oe/org.openembedded.dev/recipes/aufs/aufs2-util_git.bb do_compile failed
ERROR: Task 9 (/home/coolaj86/overo-oe/org.openembedded.dev/recipes/aufs/aufs2-util_git.bb, do_compile) failed
NOTE: Tasks Summary: Attempted 471 tasks of which 297 didn't need to be rerun and 1 failed.
ERROR: '/home/coolaj86/overo-oe/org.openembedded.dev/recipes/aufs/aufs2-util_git.bb' failed

AJ ONeal