I try to follow this : http://www.gumstix.net/Software/view/Getting-started/Setting-up-a-build-environment/111.html
One more time, same problem.

Anybody could help me ? Steve ?

Thank you :/ I don't know what to do.


2008/12/25 batoub <batoub@gmail.com>
Hi,

I try with mandriva and same problem :/

Anybody can say that there is no problem with the SVN version ?

Thank you :/


2008/12/23 batoub <batoub@gmail.com>


Hi!

I try to build the gumstix basic image but I have a strange problem. ( I'm
on ubuntu 8.10 using gcc 4.1 )

| dbus-sysdeps-unix.c: In function '_dbus_read_credentials_unix_socket':
| dbus-sysdeps-unix.c:996: error: storage size of 'cr' isn't known
| dbus-sysdeps-unix.c:999: warning: pointer targets in passing argument 5 of
'getsockopt' differ in signedness
| dbus-sysdeps-unix.c:996: warning: unused variable 'cr'
| dbus-sysdeps-unix.c: In function 'split_paths_and_append':
| dbus-sysdeps-unix.c:2550: warning: passing argument 1 of
'_dbus_string_init_const' discards qualifiers from pointer target type
| dbus-sysdeps-unix.c: In function '_dbus_get_standard_session_servicedirs':
| dbus-sysdeps-unix.c:2719: warning: passing argument 1 of
'_dbus_string_init_const' discards qualifiers from pointer target type
| make[3]: *** [dbus-sysdeps-unix.lo] Error 1
| make[3]: Leaving directory
`/home/batoub/gumstix/gumstix-oe/tmp/work/i686-linux/dbus-native-1.0.1-r0/dbus-1.0.1/dbus'
| make[2]: *** [all] Error 2
| make[2]: Leaving directory
`/home/batoub/gumstix/gumstix-oe/tmp/work/i686-linux/dbus-native-1.0.1-r0/dbus-1.0.1/dbus'
| make[1]: *** [all-recursive] Error 1
| make[1]: Leaving directory
`/home/batoub/gumstix/gumstix-oe/tmp/work/i686-linux/dbus-native-1.0.1-r0/dbus-1.0.1'
| make: *** [all] Error 2
| FATAL: oe_runmake failed
NOTE: Task failed:
/home/batoub/gumstix/gumstix-oe/tmp/work/i686-linux/dbus-native-1.0.1-r0/temp/log.do_compile.30904
NOTE: package dbus-native-1.0.1-r0: task do_compile: failed
ERROR: TaskFailed event exception, aborting
NOTE: package dbus-native-1.0.1: failed
ERROR: Build of
/home/batoub/gumstix/gumstix-oe/org.openembedded.snapshot/packages/dbus/dbus-native_1.0.1.bb
do_compile failed
ERROR: Task 1365
(/home/batoub/gumstix/gumstix-oe/org.openembedded.snapshot/packages/dbus/dbus-native_1.0.1.bb,
do_compile) failed
NOTE: Tasks Summary: Attempted 367 tasks of which 0 didn't need to be rerun
and 1 failed.
ERROR:
'/home/batoub/gumstix/gumstix-oe/org.openembedded.snapshot/packages/dbus/dbus-native_1.0.1.bb'
failed


Anybody could help me ??

Thank !
--
View this message in context: http://www.nabble.com/Problem-building-basic-image-tp21140954p21140954.html
Sent from the Gumstix mailing list archive at Nabble.com.


------------------------------------------------------------------------------
_______________________________________________
gumstix-users mailing list
gumstix-users@lists.sourceforge.net
https://lists.sourceforge.net/lists/listinfo/gumstix-users