I am trying to run "bitbake gumstix-basic-image" but run into problems. See screen dump below... Any help will be appreciated.
 
Thanks,
Kasy.
 
$ bitbake gumstix-basic-image
NOTE: Psyco JIT Compiler (http://psyco.sf.net) not available. Install it to increase performance.
NOTE: Handling BitBake files: \ (4950/4951) [99 %]ERROR: opening /home/kasy/gumstix/270/gumstix-oe/user.collection/packages/*/*.bb: [Errno 2] No such file or directory: '/home/kasy/gumstix/270/gumstix-oe/user.collection/packages/*/*.bb'
NOTE: Parsing finished. 4714 cached, 0 parsed, 236 skipped, 0 masked.
NOTE: build 200805121911: started
OE Build Configuration:
BB_VERSION = "1.8.10"
OE_REVISION = "<unknown>"
TARGET_ARCH = "arm"
TARGET_OS = "linux-gnueabi"
MACHINE = "gumstix-custom-verdex"
DISTRO = "angstrom"
DISTRO_VERSION = "2007.9-test-20080512"
TARGET_FPU = "soft"
NOTE: Resolving any missing task queue dependencies
NOTE: preferred version 2.5 of glibc not available (for item virtual/arm-angstrom-linux-gnueabi-libc-for-gcc)
NOTE: Preparing runqueue
NOTE: Executing runqueue
NOTE: Running task 54 of 1391 (ID: 207, /home/kasy/gumstix/270/gumstix-oe/org.openembedded.snapshot/packages/libtool/libtool-native_1.5.10.bb, do_compile)
NOTE: package libtool-native-1.5.10: started
NOTE: package libtool-native-1.5.10-r6: task do_compile: started
ERROR: function do_compile failed
ERROR: log data follows (/home/kasy/gumstix/270/gumstix-oe/tmp/work/i686-linux/libtool-native-1.5.10-r6/temp/log.do_compile.10406)
| NOTE: make
| Making all in .
| make[1]: Entering directory `/mnt/disk2_160gb/gumstix/270/gumstix-oe/tmp/work/i686-linux/libtool-native-1.5.10-r6/libtool-1.5.10'
| /bin/sh ./config.status --recheck
| running CONFIG_SHELL=/bin/sh /bin/sh /home/kasy/gumstix/270/gumstix-oe/tmp/work/i686-linux/libtool-native-1.5.10-r6/libtool-1.5.10/configure --build=i686-linux --host=i686-linux --target=i686-linux --prefix=/home/kasy/gumstix/270/gumstix-oe/tmp/staging --exec_prefix=/home/kasy/gumstix/270/gumstix-oe/tmp/staging/i686-linux --bindir=/home/kasy/gumstix/270/gumstix-oe/tmp/staging/i686-linux/bin --sbindir=/home/kasy/gumstix/270/gumstix-oe/tmp/staging/i686-linux/bin --libexecdir=/home/kasy/gumstix/270/gumstix-oe/tmp/staging/i686-linux/libexec --datadir=/home/kasy/gumstix/270/gumstix-oe/tmp/staging/i686-linux/share --sysconfdir=/home/kasy/gumstix/270/gumstix-oe/tmp/staging/etc --sharedstatedir=/home/kasy/gumstix/270/gumstix-oe/tmp/staging/com --localstatedir=/home/kasy/gumstix/270/gumstix-oe/tmp/staging/var --libdir=/home/kasy/gumstix/270/gumstix-oe/tmp/staging/i686-linux/lib --includedir=/home/kasy/gumstix/270/gumstix-oe/tmp/staging/i686-linux/include --oldincludedir=/home/kasy/gumstix/270/gumstix-oe/tmp/staging/i686-linux/include --infodir=/home/kasy/gumstix/270/gumstix-oe/tmp/staging/i686-linux/share/info --mandir=/home/kasy/gumstix/270/gumstix-oe/tmp/staging/i686-linux/share/man build_alias=i686-linux host_alias=i686-linux target_alias=i686-linux CC=gcc CFLAGS=-isystem/home/kasy/gumstix/270/gumstix-oe/tmp/staging/i686-linux/include -Os LDFLAGS=-L/home/kasy/gumstix/270/gumstix-oe/tmp/staging/i686-linux/lib -Wl,-rpath-link,/home/kasy/gumstix/270/gumstix-oe/tmp/staging/i686-linux/lib -Wl,-rpath,/home/kasy/gumstix/270/gumstix-oe/tmp/staging/i686-linux/lib -Wl,-O1 CPPFLAGS=-isystem/home/kasy/gumstix/270/gumstix-oe/tmp/staging/i686-linux/include CXX=g++ CXXFLAGS=-isystem/home/kasy/gumstix/270/gumstix-oe/tmp/staging/i686-linux/include -Os F77=g77 CPP=gcc -E --enable-ltdl-install --no-create --no-recursion
| checking for a BSD-compatible install... /usr/bin/install -c
| checking whether build environment is sane... yes
| checking for gawk... gawk
| checking whether make sets $(MAKE)... yes
| configure: error: source directory already configured; run "make distclean" there first
| make[1]: *** [i686-linux-libtool] Error 1
| make[1]: Leaving directory `/mnt/disk2_160gb/gumstix/270/gumstix-oe/tmp/work/i686-linux/libtool-native-1.5.10-r6/libtool-1.5.10'
| make: *** [all-recursive] Error 1
| FATAL: oe_runmake failed
NOTE: Task failed: /home/kasy/gumstix/270/gumstix-oe/tmp/work/i686-linux/libtool-native-1.5.10-r6/temp/log.do_compile.10406
NOTE: package libtool-native-1.5.10-r6: task do_compile: failed
ERROR: TaskFailed event exception, aborting
NOTE: package libtool-native-1.5.10: failed
ERROR: Build of /home/kasy/gumstix/270/gumstix-oe/org.openembedded.snapshot/packages/libtool/libtool-native_1.5.10.bb do_compile failed
ERROR: Task 207 (/home/kasy/gumstix/270/gumstix-oe/org.openembedded.snapshot/packages/libtool/libtool-native_1.5.10.bb, do_compile) failed
NOTE: Tasks Summary: Attempted 53 tasks of which 53 didn't need to be rerun and 1 failed.
ERROR: '/home/kasy/gumstix/270/gumstix-oe/org.openembedded.snapshot/packages/libtool/libtool-native_1.5.10.bb' failed
kasy@zion: /home/kasy/gumstix/270/gumstix-oe>