Just downloaded the new buildroot revision 1005
 
everything builds perfect.
 
but after
 
make menuconfig
 
and enabling TSLIB
 
make
 
after the first patch "configure.ac" tslib fails to build with errors.
 
i noticed that there is a new Kernel in revision 1005 linux-2.6.16gum
 
is that the problem?
 
in any case here are the errors i get :
 

In file included from input-raw.c:29:

/gumstix/gumstix-buildroot/build_arm_nofpu/staging_dir/bin-ccache/../lib/gcc/arm-linux-uclibc/3.4.5/../../../../arm-linux-uclibc/sys-include/linux/input.h:801: error: syntax error before "kernel_ulong_t"

/gumstix/gumstix-buildroot/build_arm_nofpu/staging_dir/bin-ccache/../lib/gcc/arm-linux-uclibc/3.4.5/../../../../arm-linux-uclibc/sys-include/linux/input.h:805: error: syntax error before "evbit"

/gumstix/gumstix-buildroot/build_arm_nofpu/staging_dir/bin-ccache/../lib/gcc/arm-linux-uclibc/3.4.5/../../../../arm-linux-uclibc/sys-include/linux/input.h:805: error: `BITS_PER_LONG' undeclared here (not in a function)

/gumstix/gumstix-buildroot/build_arm_nofpu/staging_dir/bin-ccache/../lib/gcc/arm-linux-uclibc/3.4.5/../../../../arm-linux-uclibc/sys-include/linux/input.h:806: error: syntax error before "keybit"

/gumstix/gumstix-buildroot/build_arm_nofpu/staging_dir/bin-ccache/../lib/gcc/arm-linux-uclibc/3.4.5/../../../../arm-linux-uclibc/sys-include/linux/input.h:807: error: syntax error before "relbit"

/gumstix/gumstix-buildroot/build_arm_nofpu/staging_dir/bin-ccache/../lib/gcc/arm-linux-uclibc/3.4.5/../../../../arm-linux-uclibc/sys-include/linux/input.h:808: error: syntax error before "absbit"

/gumstix/gumstix-buildroot/build_arm_nofpu/staging_dir/bin-ccache/../lib/gcc/arm-linux-uclibc/3.4.5/../../../../arm-linux-uclibc/sys-include/linux/input.h:809: error: syntax error before "mscbit"

/gumstix/gumstix-buildroot/build_arm_nofpu/staging_dir/bin-ccache/../lib/gcc/arm-linux-uclibc/3.4.5/../../../../arm-linux-uclibc/sys-include/linux/input.h:810: error: syntax error before "ledbit"

/gumstix/gumstix-buildroot/build_arm_nofpu/staging_dir/bin-ccache/../lib/gcc/arm-linux-uclibc/3.4.5/../../../../arm-linux-uclibc/sys-include/linux/input.h:811: error: syntax error before "sndbit"

/gumstix/gumstix-buildroot/build_arm_nofpu/staging_dir/bin-ccache/../lib/gcc/arm-linux-uclibc/3.4.5/../../../../arm-linux-uclibc/sys-include/linux/input.h:812: error: syntax error before "ffbit"

/gumstix/gumstix-buildroot/build_arm_nofpu/staging_dir/bin-ccache/../lib/gcc/arm-linux-uclibc/3.4.5/../../../../arm-linux-uclibc/sys-include/linux/input.h:813: error: syntax error before "swbit"

/gumstix/gumstix-buildroot/build_arm_nofpu/staging_dir/bin-ccache/../lib/gcc/arm-linux-uclibc/3.4.5/../../../../arm-linux-uclibc/sys-include/linux/input.h:815: error: syntax error before "driver_info"

/gumstix/gumstix-buildroot/build_arm_nofpu/staging_dir/bin-ccache/../lib/gcc/arm-linux-uclibc/3.4.5/../../../../arm-linux-uclibc/sys-include/linux/input.h:805: error: storage size of `evbit' isn't known

/gumstix/gumstix-buildroot/build_arm_nofpu/staging_dir/bin-ccache/../lib/gcc/arm-linux-uclibc/3.4.5/../../../../arm-linux-uclibc/sys-include/linux/input.h:806: error: storage size of `keybit' isn't known

/gumstix/gumstix-buildroot/build_arm_nofpu/staging_dir/bin-ccache/../lib/gcc/arm-linux-uclibc/3.4.5/../../../../arm-linux-uclibc/sys-include/linux/input.h:807: error: storage size of `relbit' isn't known

/gumstix/gumstix-buildroot/build_arm_nofpu/staging_dir/bin-ccache/../lib/gcc/arm-linux-uclibc/3.4.5/../../../../arm-linux-uclibc/sys-include/linux/input.h:808: error: storage size of `absbit' isn't known

/gumstix/gumstix-buildroot/build_arm_nofpu/staging_dir/bin-ccache/../lib/gcc/arm-linux-uclibc/3.4.5/../../../../arm-linux-uclibc/sys-include/linux/input.h:809: error: storage size of `mscbit' isn't known

/gumstix/gumstix-buildroot/build_arm_nofpu/staging_dir/bin-ccache/../lib/gcc/arm-linux-uclibc/3.4.5/../../../../arm-linux-uclibc/sys-include/linux/input.h:810: error: storage size of `ledbit' isn't known

/gumstix/gumstix-buildroot/build_arm_nofpu/staging_dir/bin-ccache/../lib/gcc/arm-linux-uclibc/3.4.5/../../../../arm-linux-uclibc/sys-include/linux/input.h:811: error: storage size of `sndbit' isn't known

/gumstix/gumstix-buildroot/build_arm_nofpu/staging_dir/bin-ccache/../lib/gcc/arm-linux-uclibc/3.4.5/../../../../arm-linux-uclibc/sys-include/linux/input.h:812: error: storage size of `ffbit' isn't known

/gumstix/gumstix-buildroot/build_arm_nofpu/staging_dir/bin-ccache/../lib/gcc/arm-linux-uclibc/3.4.5/../../../../arm-linux-uclibc/sys-include/linux/input.h:813: error: storage size of `swbit' isn't known

make[3]: *** [input-raw.lo] Error 1

make[3]: *** Waiting for unfinished jobs....

/gumstix/gumstix-buildroot/build_arm_nofpu/staging_dir/bin/arm-linux-uclibc-gcc -shared .libs/linear.o -march=armv5te -mtune=xscale -Wl,-soname -Wl,linear.so -o .libs/linear.so

creating linear.la

(cd .libs && rm -f linear.la && ln -s ../linear.la linear.la)

/gumstix/gumstix-buildroot/build_arm_nofpu/staging_dir/bin/arm-linux-uclibc-gcc -shared .libs/dejitter.o -march=armv5te -mtune=xscale -Wl,-soname -Wl,dejitter.so -o .libs/dejitter.so

creating dejitter.la

(cd .libs && rm -f dejitter.la && ln -s ../dejitter.la dejitter.la)

make[3]: Leaving directory `/gumstix/gumstix-buildroot/build_arm_nofpu/tslib/plugins'

make[2]: *** [all-recursive] Error 1

make[2]: Leaving directory `/gumstix/gumstix-buildroot/build_arm_nofpu/tslib'

make[1]: *** [all] Error 2

make[1]: Leaving directory `/gumstix/gumstix-buildroot/build_arm_nofpu/tslib'

make: *** [/gumstix/gumstix-buildroot/build_arm_nofpu/tslib/.compiled] Error 2

 

why is this?

 
 
 
 
Demetris Z.