Learn how easy it is to sync an existing GitHub or Google Code repo to a SourceForge project! See Demo

Close

#16 Problem compiling gnotepad 1.3.3

open
nobody
None
5
2014-08-16
2001-10-24
Anonymous
No

Hi,

I try to compile gnotepad 1.3.3 on my linux slackware 8 with gcc-3.0.1
there was no problem with the configure, but for the make i got this :

root@pierre:/tmp/gnotepad+-1.3.3# gmake
gmake all-recursive
gmake[1]: Entering directory `/tmp/gnotepad+-1.3.3'
Making all in docs
gmake[2]: Entering directory `/tmp/gnotepad+-1.3.3/docs'
Making all in C
gmake[3]: Entering directory `/tmp/gnotepad+-1.3.3/docs/C'
gmake[3]: Nothing to be done for `all'.
gmake[3]: Leaving directory `/tmp/gnotepad+-1.3.3/docs/C'
gmake[3]: Entering directory `/tmp/gnotepad+-1.3.3/docs'
gmake[3]: Nothing to be done for `all-am'.
gmake[3]: Leaving directory `/tmp/gnotepad+-1.3.3/docs'
gmake[2]: Leaving directory `/tmp/gnotepad+-1.3.3/docs'
Making all in po
gmake[2]: Entering directory `/tmp/gnotepad+-1.3.3/po'
gmake[2]: Leaving directory `/tmp/gnotepad+-1.3.3/po'
Making all in intl
gmake[2]: Entering directory `/tmp/gnotepad+-1.3.3/intl'
gmake[2]: Nothing to be done for `all'.
gmake[2]: Leaving directory `/tmp/gnotepad+-1.3.3/intl'
Making all in src
gmake[2]: Entering directory `/tmp/gnotepad+-1.3.3/src'
Making all in xpm
gmake[3]: Entering directory `/tmp/gnotepad+-1.3.3/src/xpm'
gmake[3]: Nothing to be done for `all'.
gmake[3]: Leaving directory `/tmp/gnotepad+-1.3.3/src/xpm'
gmake[3]: Entering directory `/tmp/gnotepad+-1.3.3/src'
gcc -DHAVE_CONFIG_H -I. -I. -I.. -DLOCALEDIR=\""/usr/local/share/locale"\" -g -O2 -Wall -Wmissing-prototypes -Wno-implicit-int -I/usr/local/include -DNEED_GNOMESUPPORT_H -I/usr/local/lib/gnome-libs/include -I/usr/local/include/gtk-1.2 -I/usr/local/include/glib-1.2 -I/usr/local/lib/glib/include -I/usr/local/include/libglade-1.0 -I/usr/local/include/gnome-xml -c about.c
Creating appinfo.c
gcc -DHAVE_CONFIG_H -I. -I. -I.. -DLOCALEDIR=\""/usr/local/share/locale"\" -g -O2 -Wall -Wmissing-prototypes -Wno-implicit-int -I/usr/local/include -DNEED_GNOMESUPPORT_H -I/usr/local/lib/gnome-libs/include -I/usr/local/include/gtk-1.2 -I/usr/local/include/glib-1.2 -I/usr/local/lib/glib/include -I/usr/local/include/libglade-1.0 -I/usr/local/include/gnome-xml -c appinfo.c
gcc -DHAVE_CONFIG_H -I. -I. -I.. -DLOCALEDIR=\""/usr/local/share/locale"\" -g -O2 -Wall -Wmissing-prototypes -Wno-implicit-int -I/usr/local/include -DNEED_GNOMESUPPORT_H -I/usr/local/lib/gnome-libs/include -I/usr/local/include/gtk-1.2 -I/usr/local/include/glib-1.2 -I/usr/local/lib/glib/include -I/usr/local/include/libglade-1.0 -I/usr/local/include/gnome-xml -c clipboard.c
gcc -DHAVE_CONFIG_H -I. -I. -I.. -DLOCALEDIR=\""/usr/local/share/locale"\" -g -O2 -Wall -Wmissing-prototypes -Wno-implicit-int -I/usr/local/include -DNEED_GNOMESUPPORT_H -I/usr/local/lib/gnome-libs/include -I/usr/local/include/gtk-1.2 -I/usr/local/include/glib-1.2 -I/usr/local/lib/glib/include -I/usr/local/include/libglade-1.0 -I/usr/local/include/gnome-xml -c debug.c
gcc -DHAVE_CONFIG_H -I. -I. -I.. -DLOCALEDIR=\""/usr/local/share/locale"\" -g -O2 -Wall -Wmissing-prototypes -Wno-implicit-int -I/usr/local/include -DNEED_GNOMESUPPORT_H -I/usr/local/lib/gnome-libs/include -I/usr/local/include/gtk-1.2 -I/usr/local/include/glib-1.2 -I/usr/local/lib/glib/include -I/usr/local/include/libglade-1.0 -I/usr/local/include/gnome-xml -c dialog.c
gcc -DHAVE_CONFIG_H -I. -I. -I.. -DLOCALEDIR=\""/usr/local/share/locale"\" -g -O2 -Wall -Wmissing-prototypes -Wno-implicit-int -I/usr/local/include -DNEED_GNOMESUPPORT_H -I/usr/local/lib/gnome-libs/include -I/usr/local/include/gtk-1.2 -I/usr/local/include/glib-1.2 -I/usr/local/lib/glib/include -I/usr/local/include/libglade-1.0 -I/usr/local/include/gnome-xml -c doc.c
In file included from doc.c:35:
htmlview.h:50: parse error before "GtkHTMLStreamHandle"
doc.c: In function `doc_new':
doc.c:1040: too many arguments to function `gtk_html_new'
gmake[3]: *** [doc.o] Error 1
gmake[3]: Leaving directory `/tmp/gnotepad+-1.3.3/src'
gmake[2]: *** [all-recursive] Error 1
gmake[2]: Leaving directory `/tmp/gnotepad+-1.3.3/src'
gmake[1]: *** [all-recursive] Error 1
gmake[1]: Leaving directory `/tmp/gnotepad+-1.3.3'
gmake: *** [all-recursive-am] Error 2

I have gtkhtml 0.15 installed.

It would be great if you could help me with this !

Best regards,

Pierre.

Discussion