#36 GemRB 0.2.2.9c fails to compile, missing headers

closed-wont-fix
nobody
None
5
2004-11-01
2004-10-27
No

GemRB 0.2.2.9c fails to compile on i686-pc-linux-gnu
(gentoo). The configure script fails too, but removing
gemrb/Config from AC_CONFIG_FILES helps. After issuing
'make' in gemrb/plugins/Core I get the following error:

GameScript.cpp:25:36: ../../includes/strrefs.h: No such
file or directory
GameScript.cpp: In static member function `static void
GameScript::BeginDialog(Scriptable*, Action*, int)':
GameScript.cpp:5775: error: `STR_TARGETBUSY' undeclared
(first use this
function)
GameScript.cpp:5775: error: (Each undeclared identifier
is reported only once
for each function it appears in.)
make: *** [GameScript.lo] Error 1

Discussion

  • Laszlo Toth
    Laszlo Toth
    2004-11-01

    • status: open --> closed-wont-fix
     
  • Laszlo Toth
    Laszlo Toth
    2004-11-01

    Logged In: YES
    user_id=885460

    You can obtain the missing file from the CVS.
    By the way, we have comitted a lot of changes since the
    latest tarball, so it might be more useful if you get the
    sources from the CVS.
    (There is no way to go back and fix it)