#1 spellcheck plugin: make fails

closed-invalid
None
5
2008-07-07
2008-06-29
Anonymous
No

Hello, errors attached.

Discussion

  • Enrico Tröger
    Enrico Tröger
    2008-06-29

    Logged In: YES
    user_id=1117045
    Originator: NO

    Your version of Geany seems to be to old. Please update your Geany to latest SVN version (at least rev 2733).

     
  • Enrico Tröger
    Enrico Tröger
    2008-06-29

    • assigned_to: nobody --> eht16
     
  • Nick Treleaven
    Nick Treleaven
    2008-06-30

    • summary: make fails --> spellcheck plugin: make fails
     
  • Marco P
    Marco P
    2008-07-04

    Logged In: YES
    user_id=1528549
    Originator: NO

    I've checkout and installed a recent svn version:
    geany 0.15 (built on Jul 3 2008 with GTK 2.12.10, GLib 2.16.3)

    Still refuse to install with different errors:

    /bin/sh ../libtool --silent --tag=CC --mode=compile gcc -DHAVE_CONFIG_H -I. -I.. -I/usr/include/geany -I/usr/include/geany/tagmanager -I/usr/include/geany/scintilla -I/usr/include/gtk-2.0 -I/usr/lib/gtk-2.0/include -I/usr/include/atk-1.0 -I/usr/include/cairo -I/usr/include/pango-1.0 -I/usr/include/glib-2.0 -I/usr/lib/glib-2.0/include -DLOCALEDIR=\""/usr/local/share/locale"\" -g -O2 -MT spellcheck.lo -MD -MP -MF .deps/spellcheck.Tpo -c -o spellcheck.lo spellcheck.c
    spellcheck.c: In function ‘check_document’:
    spellcheck.c:104: error: ‘geany_functions’ undeclared (first use in this function)
    spellcheck.c:104: error: (Each undeclared identifier is reported only once
    spellcheck.c:104: error: for each function it appears in.)
    spellcheck.c:104: error: ‘doc_list’ undeclared (first use in this function)
    spellcheck.c:136: warning: incompatible implicit declaration of built-in function ‘strlen’
    spellcheck.c: In function ‘perform_check’:
    spellcheck.c:183: error: ‘geany_functions’ undeclared (first use in this function)
    spellcheck.c: In function ‘item_activate’:
    spellcheck.c:208: error: ‘geany_functions’ undeclared (first use in this function)
    spellcheck.c: In function ‘find_index’:
    spellcheck.c:291: error: ‘geany_functions’ undeclared (first use in this function)
    spellcheck.c: In function ‘plugin_init’:
    spellcheck.c:307: error: ‘geany_functions’ undeclared (first use in this function)
    spellcheck.c:314: error: ‘GeanyData’ has no member named ‘tools_menu’
    spellcheck.c: In function ‘configure’:
    spellcheck.c:335: error: ‘geany_functions’ undeclared (first use in this function)
    make[1]: *** [spellcheck.lo] Error 1
    make[1]: Leaving directory `/u/care/spellcheck-0.1/src'
    make: *** [install-recursive] Error 1

     
  • Nick Treleaven
    Nick Treleaven
    2008-07-04

    Logged In: YES
    user_id=1268692
    Originator: NO

    Hi,
    You probably now need to update the spellcheck plugin SVN to the latest commit ('svn up' and rebuild). This is necessary because there have been some incompatible changes in the plugin API since v0.14.

     
  • Marco P
    Marco P
    2008-07-04

    Logged In: YES
    user_id=1528549
    Originator: NO

    That is right, smooth install and using it already. Not a bug.

    Thank you all guys for your great work.

     
  • Nick Treleaven
    Nick Treleaven
    2008-07-07

    • status: open --> closed-invalid