#469 Error while compilling gabber

critical
open
nobody
binaries (50)
5
2014-08-19
2004-06-15
Anonymous
No

PLD linux 1.99 (AC)
software can not be compiled because of errors connected to
sigc++-2.0
I'm writting as a supporter of PLD developer and that's log:

daniel[at]mat[dot]uni[dot]torun[dot]pl URGENT!

Wykonywanie(%prep): /bin/sh -e /var/tmp/rpm-tmp.20891
+ umask 022
+ cd /home/users/krzysiek/rpm/BUILD
+ LANG=C
+ export LANG
+ unset DISPLAY
+ cd /home/users/krzysiek/rpm/BUILD
+ rm -rf Gabber-1.9.4
+ /bin/gzip -dc /home/users/krzysiek/rpm/SOURCES/Gabber-1.9.4.
tar.gz
+ tar -xf -
+ STATUS=0
+ [ 0 -ne 0 ]
+ cd Gabber-1.9.4
+ /bin/id -u
+ [ 501 = 0 ]
+ true .
+ /bin/chmod -Rf a+rX,g-w,o-w .
+ echo Patch #0 (gabber-types.patch):
Patch #0 (gabber-types.patch):
+ patch -p1 -s
+ < /home/users/krzysiek/rpm/SOURCES/gabber-types.patch
+ echo Patch #1 (gabber-conffix.patch):
Patch #1 (gabber-conffix.patch):
+ patch -p1 -s
+ < /home/users/krzysiek/rpm/SOURCES/gabber-conffix.patch
+ exit 0
Wykonywanie(%build): /bin/sh -e /var/tmp/rpm-tmp.20891
+ umask 022
+ cd /home/users/krzysiek/rpm/BUILD
+ cd Gabber-1.9.4
+ LANG=C
+ export LANG
+ unset DISPLAY
+ CXXFLAGS=-O2 -march=i686
+ ./configure LDFLAGS= CFLAGS=-O2 -march=i686
CXXFLAGS=-O2 -march=i686 FFLAGS=-O2 -march=i686
CPPFLAGS= CC=i686-pld-linux-gcc CXX=i686-pld-linux-g++
--build=i686-pld-linux --prefix=/usr --exec-prefix=/usr --bindir=/usr/bin
--sbindir=/usr/sbin --sysconfdir=/etc --datadir=/usr/share
--includedir=/usr/include --libdir=/usr/lib --libexecdir=/usr/lib
--localstatedir=/var --sharedstatedir=/var/lib --mandir=/usr/share/man
--infodir=/usr/share/info --x-libraries=/usr/X11R6/lib --disable-debug
--disable-schemas-install
checking for a BSD-compatible install... /usr/bin/install -c
checking whether build environment is sane... yes
checking for gawk... gawk
checking whether make sets $(MAKE)... yes
checking for gcc... i686-pld-linux-gcc
checking for C compiler default output... a.out
checking whether the C compiler works... yes
checking whether we are cross compiling... no
checking for suffix of executables...
checking for suffix of object files... o
checking whether we are using the GNU C compiler... yes
checking whether i686-pld-linux-gcc accepts -g... yes
checking for i686-pld-linux-gcc option to accept ANSI C... none
needed
checking for style of include used by make... GNU
checking dependency style of i686-pld-linux-gcc... gcc3
checking whether we are using the GNU C++ compiler... yes
checking whether i686-pld-linux-g++ accepts -g... yes
checking dependency style of i686-pld-linux-g++... gcc3
checking for a BSD-compatible install... /usr/bin/install -c
checking build system type... i686-pld-linux-gnu
checking host system type... i686-pld-linux-gnu
checking for a sed that does not truncate output... /bin/sed
checking for egrep... grep -E
checking for ld used by i686-pld-linux-gcc... /usr/bin/ld
checking if the linker (/usr/bin/ld) is GNU ld... yes
checking for /usr/bin/ld option to reload object files... -r
checking for BSD-compatible nm... /usr/bin/nm -B
checking whether ln -s works... yes
checking how to recognise dependent libraries... pass_all
checking how to run the C preprocessor... i686-pld-linux-gcc -E
checking for ANSI C header files... yes
checking for sys/types.h... yes
checking for sys/stat.h... yes
checking for stdlib.h... yes
checking for string.h... yes
checking for memory.h... yes
checking for strings.h... yes
checking for inttypes.h... yes
checking for stdint.h... yes
checking for unistd.h... yes
checking dlfcn.h usability... yes
checking dlfcn.h presence... yes
checking for dlfcn.h... yes
checking how to run the C++ preprocessor... i686-pld-linux-g++ -E
checking for g77... no
checking for f77... no
checking for xlf... no
checking for frt... no
checking for pgf77... no
checking for fl32... no
checking for af77... no
checking for fort77... no
checking for f90... no
checking for xlf90... no
checking for pgf90... no
checking for epcf90... no
checking for f95... no
checking for fort... no
checking for xlf95... no
checking for lf95... no
checking for g95... no
checking whether we are using the GNU Fortran 77 compiler... no
checking whether accepts -g... no
checking the maximum length of command line arguments... 32768
checking command to parse /usr/bin/nm -B output from
i686-pld-linux-gcc object... ok
checking for objdir... .libs
checking for ar... ar
checking for ranlib... ranlib
checking for strip... strip
checking if i686-pld-linux-gcc static flag works... yes
checking if i686-pld-linux-gcc supports -fno-rtti -fno-exceptions... no
checking for i686-pld-linux-gcc option to produce PIC... -fPIC
checking if i686-pld-linux-gcc PIC flag -fPIC works... yes
checking if i686-pld-linux-gcc supports -c -o file.o... yes
checking whether the i686-pld-linux-gcc linker (/usr/bin/ld) supports
shared libraries... yes
checking how to hardcode library paths into programs... immediate
checking whether stripping libraries is possible... yes
checking dynamic linker characteristics... GNU/Linux ld.so
checking if libtool supports shared libraries... yes
checking whether to build shared libraries... yes
checking whether to build static libraries... yes
configure: creating libtool
appending configuration tag "CXX" to libtool
checking for ld used by i686-pld-linux-g++... /usr/bin/ld
checking if the linker (/usr/bin/ld) is GNU ld... yes
checking whether the i686-pld-linux-g++ linker (/usr/bin/ld) supports
shared libraries... yes
checking for i686-pld-linux-g++ option to produce PIC... -fPIC
checking if i686-pld-linux-g++ PIC flag -fPIC works... yes
checking if i686-pld-linux-g++ supports -c -o file.o... yes
checking whether the i686-pld-linux-g++ linker (/usr/bin/ld) supports
shared libraries... yes
checking how to hardcode library paths into programs... immediate
checking whether stripping libraries is possible... yes
checking dynamic linker characteristics... GNU/Linux ld.so
appending configuration tag "F77" to libtool
checking for intltool >= 0.23... 0.30 found
checking for perl... /usr/bin/perl
checking locale.h usability... yes
checking locale.h presence... yes
checking for locale.h... yes
checking for LC_MESSAGES... yes
checking libintl.h usability... yes
checking libintl.h presence... yes
checking for libintl.h... yes
checking for dgettext in libc... yes
checking for bind_textdomain_codeset... yes
checking for msgfmt... /usr/bin/msgfmt
checking for dcgettext... yes
checking for gmsgfmt... /usr/bin/msgfmt
checking for xgettext... /usr/bin/xgettext
checking for X... libraries /usr/X11R6/lib, headers
/usr/X11R6/include
checking for gethostbyname... yes
checking for connect... yes
checking for remove... yes
checking for shmat... yes
checking for IceConnectionNumber in -lICE... yes
checking for pkg-config... /usr/bin/pkg-config
checking for gtkmm-2.4 gconfmm-2.6 libglademm-2.4... yes
checking DEPS_CFLAGS... -DORBIT2=1 -pthread
-I/usr/include/gtkmm-2.4 -I/usr/lib/gtkmm-2.4/include
-I/usr/include/glibmm-2.4 -I/usr/lib/glibmm-2.4/include
-I/usr/include/gdkmm-2.4 -I/usr/lib/gdkmm-2.4/include
-I/usr/include/pangomm-1.4 -I/usr/include/atkmm-1.6
-I/usr/include/gtk-2.0 -I/usr/include/sigc++-2.0 -I/usr/lib/sigc++-2.
0/include -I/usr/include/glib-2.0 -I/usr/lib/glib-2.0/include
-I/usr/lib/gtk-2.0/include -I/usr/X11R6/include -I/usr/include/pango-1.0
-I/usr/include/freetype2 -I/usr/include/atk-1.0
-I/usr/include/gconfmm-2.6 -I/usr/lib/gconfmm-2.6/include
-I/usr/include/gconf2 -I/usr/include/orbit-2.0
-I/usr/include/libglademm-2.4 -I/usr/lib/libglademm-2.4/include
-I/usr/include/libglade-2.0 -I/usr/include/libxml2
checking DEPS_LIBS... -Wl,--export-dynamic -pthread
-L/usr/X11R6/lib -lgconfmm-2.6 -lgconf-2 -lORBit-2 -lgthread-2.0
-lglademm-2.4 -lgtkmm-2.4 -lglade-2.0 -lgdkmm-2.4 -latkmm-1.6
-lpangomm-1.4 -lglibmm-2.4 -lsigc-2.0 -lgtk-x11-2.0 -lxml2 -lpthread
-lgdk-x11-2.0 -lXi -lXinerama -lXext -lXcursor -latk-1.0
-lgdk_pixbuf-2.0 -lm -lpangoxft-1.0 -lXft -lfreetype -lz -lXrender
-lfontconfig -lpangox-1.0 -lX11 -lpango-1.0 -lgobject-2.0 -lgmodule-2.0
-ldl -lglib-2.0
checking for gconftool-2... /usr/bin/gconftool-2
Using config source xml::/etc/gconf/gconf.xml.defaults for schema
installation
Using $(sysconfdir)/gconf/schemas/ as install directory for schema
files
checking for jabberoo >= 1.9.4... yes
checking JABBEROO_CFLAGS... -I/usr/include/jabberoo
-I/usr/lib/sigc++-1.2/include -I/usr/include/sigc++-1.2
checking JABBEROO_LIBS... -ljabberoo -lsigc-1.2
checking SSL Support... yes
checking GtkSpell... yes
checking aspell.h usability... yes
checking aspell.h presence... yes
checking for aspell.h... yes
checking pspell/pspell.h usability... yes
checking pspell/pspell.h presence... yes
checking for pspell/pspell.h... yes
checking for new_aspell_speller in -laspell... yes
checking for debugging... no
checking if C++ environment has ostringstream in std... yes
checking for gethostbyname_r... yes
checking for glibc gethostbyname_r... yes
checking for socklen_t... yes
checking for XScreenSaverRegister in -lXext... no
checking for XScreenSaverRegister in -lXss... yes
checking for gconfmm-2.6... yes
checking PLATFORM_CFLAGS... -DORBIT2=1 -pthread
-I/usr/include/gconfmm-2.6 -I/usr/lib/gconfmm-2.6/include
-I/usr/include/glibmm-2.4 -I/usr/lib/glibmm-2.4/include
-I/usr/include/gconf2 -I/usr/include/sigc++-2.0 -I/usr/lib/sigc++-2.
0/include -I/usr/include/glib-2.0 -I/usr/lib/glib-2.0/include
-I/usr/include/orbit-2.0
checking PLATFORM_LIBS... -pthread -Wl,--export-dynamic
-lgconfmm-2.6 -lglibmm-2.4 -lgconf-2 -lsigc-2.0 -lORBit-2 -lgobject-2.0
-lm -lgmodule-2.0 -ldl -lgthread-2.0 -lglib-2.0
configure: creating ./config.status
config.status: creating src/linux/Makefile
config.status: creating src/osx/Makefile
config.status: creating src/win32/Makefile
config.status: creating Makefile
config.status: creating doxygen.cfg
config.status: creating gabber.schemas
config.status: creating gabber.desktop
config.status: creating src/Makefile
config.status: creating src/modules/Makefile
config.status: creating pixmaps/Makefile
config.status: creating po/Makefile.in
config.status: creating ui/Makefile
config.status: creating config.h
config.status: executing depfiles commands
config.status: executing default-1 commands
config.status: executing default-2 commands

Configuration:
Install path: /usr
Debugging symbols: no
Enable OpenSSL support: yes
GtkSpell spell checking: yes
XScreenSaver Extension: yes
+ /usr/bin/make
/usr/bin/make all-recursive
make[1]: Entering directory
`/home/users/krzysiek/rpm/BUILD/Gabber-1.9.4'
Making all in src
make[2]: Entering directory
`/home/users/krzysiek/rpm/BUILD/Gabber-1.9.4/src'
Making all in linux
make[3]: Entering directory
`/home/users/krzysiek/rpm/BUILD/Gabber-1.9.4/src/linux'
if i686-pld-linux-g++ -DHAVE_CONFIG_H -I. -I. -I../.. -DORBIT2=1
-pthread -I/usr/include/gconfmm-2.6 -I/usr/lib/gconfmm-2.6/include
-I/usr/include/glibmm-2.4 -I/usr/lib/glibmm-2.4/include
-I/usr/include/gconf2 -I/usr/include/sigc++-2.0 -I/usr/lib/sigc++-2.
0/include -I/usr/include/glib-2.0 -I/usr/lib/glib-2.0/include
-I/usr/include/orbit-2.0 -I.. -O2 -march=i686 -Wall -O2 -MT
GConfConfigurator.o -MD -MP -MF ".deps/GConfConfigurator.
Tpo" \ -c -o GConfConfigurator.o `test -f 'GConfConfigurator.cc' || echo '.
/'`GConfConfigurator.cc; \ then mv -f ".deps/GConfConfigurator.Tpo" ".
deps/GConfConfigurator.Po"; \ else rm -f ".deps/GConfConfigurator.Tpo"; exit 1; \ fi
if i686-pld-linux-g++ -DHAVE_CONFIG_H -I. -I. -I../.. -DORBIT2=1
-pthread -I/usr/include/gconfmm-2.6 -I/usr/lib/gconfmm-2.6/include
-I/usr/include/glibmm-2.4 -I/usr/lib/glibmm-2.4/include
-I/usr/include/gconf2 -I/usr/include/sigc++-2.0 -I/usr/lib/sigc++-2.
0/include -I/usr/include/glib-2.0 -I/usr/lib/glib-2.0/include
-I/usr/include/orbit-2.0 -I.. -O2 -march=i686 -Wall -O2 -MT
PlatformFuncs.o -MD -MP -MF ".deps/PlatformFuncs.Tpo" \ -c -o PlatformFuncs.o `test -f 'PlatformFuncs.cc' || echo '.
/'`PlatformFuncs.cc; \ then mv -f ".deps/PlatformFuncs.Tpo" ".deps/PlatformFuncs.Po"; \ else rm -f ".deps/PlatformFuncs.Tpo"; exit 1; \ fi
rm -f libplatform.a
ar cru libplatform.a GConfConfigurator.o PlatformFuncs.o
ranlib libplatform.a
make[3]: Leaving directory
`/home/users/krzysiek/rpm/BUILD/Gabber-1.9.4/src/linux'
Making all in modules
make[3]: Entering directory
`/home/users/krzysiek/rpm/BUILD/Gabber-1.9.4/src/modules'
if /bin/sh ../../libtool --mode=compile i686-pld-linux-g++
-DHAVE_CONFIG_H -I. -I. -I../..
-DLOCALEDIR=\""/usr/share/locale"\"
-DPIXMAPDIR=\""/usr/share/pixmaps/Gabber"\"
-DPKGDATADIR=\""/usr/share/Gabber"\"
-DPKGLIBDIR=\""/usr/lib/Gabber"\" -O2 -march=i686 -Wall -O2
-DORBIT2=1 -pthread -I/usr/include/gtkmm-2.4 -I/usr/lib/gtkmm-2.
4/include -I/usr/include/glibmm-2.4 -I/usr/lib/glibmm-2.4/include
-I/usr/include/gdkmm-2.4 -I/usr/lib/gdkmm-2.4/include
-I/usr/include/pangomm-1.4 -I/usr/include/atkmm-1.6
-I/usr/include/gtk-2.0 -I/usr/include/sigc++-2.0 -I/usr/lib/sigc++-2.
0/include -I/usr/include/glib-2.0 -I/usr/lib/glib-2.0/include
-I/usr/lib/gtk-2.0/include -I/usr/X11R6/include -I/usr/include/pango-1.0
-I/usr/include/freetype2 -I/usr/include/atk-1.0
-I/usr/include/gconfmm-2.6 -I/usr/lib/gconfmm-2.6/include
-I/usr/include/gconf2 -I/usr/include/orbit-2.0
-I/usr/include/libglademm-2.4 -I/usr/lib/libglademm-2.4/include
-I/usr/include/libglade-2.0 -I/usr/include/libxml2
-I/usr/include/jabberoo -I/usr/lib/sigc++-1.2/include
-I/usr/include/sigc++-1.2 -I../../src -O2 -march=i686 -Wall -O2 -MT
ChatViewManager.lo -MD -MP -MF ".deps/ChatViewManager.Tpo" \ -c -o ChatViewManager.lo `test -f 'ChatViewManager.cc' || echo '.
/'`ChatViewManager.cc; \ then mv -f ".deps/ChatViewManager.Tpo" ".
deps/ChatViewManager.Plo"; \ else rm -f ".deps/ChatViewManager.Tpo"; exit 1; \ fi
mkdir .libs
i686-pld-linux-g++ -DHAVE_CONFIG_H -I. -I. -I../..
-DLOCALEDIR=\"/usr/share/locale\"
-DPIXMAPDIR=\"/usr/share/pixmaps/Gabber\"
-DPKGDATADIR=\"/usr/share/Gabber\"
-DPKGLIBDIR=\"/usr/lib/Gabber\" -O2 -march=i686 -Wall -O2
-DORBIT2=1 -pthread -I/usr/include/gtkmm-2.4 -I/usr/lib/gtkmm-2.
4/include -I/usr/include/glibmm-2.4 -I/usr/lib/glibmm-2.4/include
-I/usr/include/gdkmm-2.4 -I/usr/lib/gdkmm-2.4/include
-I/usr/include/pangomm-1.4 -I/usr/include/atkmm-1.6
-I/usr/include/gtk-2.0 -I/usr/include/sigc++-2.0 -I/usr/lib/sigc++-2.
0/include -I/usr/include/glib-2.0 -I/usr/lib/glib-2.0/include
-I/usr/lib/gtk-2.0/include -I/usr/X11R6/include -I/usr/include/pango-1.0
-I/usr/include/freetype2 -I/usr/include/atk-1.0
-I/usr/include/gconfmm-2.6 -I/usr/lib/gconfmm-2.6/include
-I/usr/include/gconf2 -I/usr/include/orbit-2.0
-I/usr/include/libglademm-2.4 -I/usr/lib/libglademm-2.4/include
-I/usr/include/libglade-2.0 -I/usr/include/libxml2
-I/usr/include/jabberoo -I/usr/lib/sigc++-1.2/include
-I/usr/include/sigc++-1.2 -I../../src -O2 -march=i686 -Wall -O2 -MT
ChatViewManager.lo -MD -MP -MF .deps/ChatViewManager.Tpo -c
ChatViewManager.cc -fPIC -DPIC -o .libs/ChatViewManager.o
In file included from /usr/include/jabberoo/session.hh:42,
from ../../src/PacketQueue.hh:24,
from ../../src/JabberConnection.hh:25,
from ../../src/GabberApp.hh:26,
from ChatViewManager.cc:23:
/usr/include/sigc++-2.0/sigc++/signal.h: In instantiation of `sigc::
internal::signal_emit0<void, SigC::Marshal<void> >':
/usr/include/sigc++-2.0/sigc++/signal.h:1544: instantiated from `sigc::
signal0<void, SigC::Marshal<void> >'
/usr/include/jabberoo/roster.hh:302: instantiated from `SigC::
Signal0<void, SigC::Marshal<void> >'
/usr/include/jabberoo/roster.hh:302: instantiated from here
/usr/include/sigc++-2.0/sigc++/signal.h:408: error: invalid use of
undefined
type `struct SigC::Marshal<void>'
/usr/include/jabberoo/jabberoofwd.h:40: error: declaration of `struct
SigC::Marshal<void>'
/usr/include/sigc++-2.0/sigc++/signal.h:410: error: invalid use of
undefined
type `struct SigC::Marshal<void>'
/usr/include/jabberoo/jabberoofwd.h:40: error: declaration of `struct
SigC::Marshal<void>'
/usr/include/sigc++-2.0/sigc++/signal.h:428: error: invalid use of
undefined
type `struct SigC::Marshal<void>'
/usr/include/jabberoo/jabberoofwd.h:40: error: declaration of `struct
SigC::Marshal<void>'
/usr/include/sigc++-2.0/sigc++/signal.h: In instantiation of `sigc::
signal0<void, SigC::Marshal<void> >':
/usr/include/jabberoo/roster.hh:302: instantiated from `SigC::
Signal0<void, SigC::Marshal<void> >'
/usr/include/jabberoo/roster.hh:302: instantiated from here
/usr/include/sigc++-2.0/sigc++/signal.h:1544: error: no type named
`result_type
' in `struct sigc::internal::signal_emit0<void, SigC::Marshal<void>
>'
/usr/include/sigc++-2.0/sigc++/signal.h:1576: error: no type named
`result_type
' in `struct sigc::internal::signal_emit0<void, SigC::Marshal<void>
>'
/usr/include/sigc++-2.0/sigc++/signal.h:1580: error: no type named
`result_type
' in `struct sigc::internal::signal_emit0<void, SigC::Marshal<void>
>'
/usr/include/sigc++-2.0/sigc++/signal.h:1590: error: no type named
`result_type
' in `struct sigc::internal::signal_emit0<void, SigC::Marshal<void>
>'
/usr/include/sigc++-2.0/sigc++/signal.h: In instantiation of `SigC::
Signal0<void, SigC::Marshal<void> >':
/usr/include/jabberoo/roster.hh:302: instantiated from here
/usr/include/sigc++-2.0/sigc++/signal.h:2730: error: no type named
`result_type
' in `class sigc::signal0<void, SigC::Marshal<void> >'
/usr/include/sigc++-2.0/sigc++/signal.h: In instantiation of `sigc::
internal::signal_emit3<void, const std::string&, bool, jabberoo::
Presence::Type, SigC::Marshal<void> >':
/usr/include/sigc++-2.0/sigc++/signal.h:1853: instantiated from `sigc:
:signal3<void, const std::string&, bool, jabberoo::Presence::Type,
SigC::Marshal<void> >'
/usr/include/jabberoo/roster.hh:322: instantiated from `SigC::
Signal3<void, const std::string&, bool, jabberoo::Presence::Type,
SigC::Marshal<void> >'
/usr/include/jabberoo/roster.hh:322: instantiated from here
/usr/include/sigc++-2.0/sigc++/signal.h:789: error: invalid use of
undefined
type `struct SigC::Marshal<void>'
/usr/include/jabberoo/jabberoofwd.h:40: error: declaration of `struct
SigC::Marshal<void>'
/usr/include/sigc++-2.0/sigc++/signal.h:791: error: invalid use of
undefined
type `struct SigC::Marshal<void>'
/usr/include/jabberoo/jabberoofwd.h:40: error: declaration of `struct
SigC::Marshal<void>'
/usr/include/sigc++-2.0/sigc++/signal.h: In instantiation of `sigc::
internal::signal_emit3<void, const std::string&, bool, jabberoo::
Presence::Type, SigC::Marshal<void> >':
/usr/include/sigc++-2.0/sigc++/signal.h:1853: instantiated from `sigc:
:signal3<void, const std::string&, bool, jabberoo::Presence::Type,
SigC::Marshal<void> >'
/usr/include/jabberoo/roster.hh:322: instantiated from `SigC::
Signal3<void, const std::string&, bool, jabberoo::Presence::Type,
SigC::Marshal<void> >'
/usr/include/jabberoo/roster.hh:322: instantiated from here
/usr/include/sigc++-2.0/sigc++/signal.h:819: error: invalid use of
undefined
type `struct SigC::Marshal<void>'
/usr/include/jabberoo/jabberoofwd.h:40: error: declaration of `struct
SigC::Marshal<void>'
/usr/include/sigc++-2.0/sigc++/signal.h: In instantiation of `sigc::
signal3<void, const std::string&, bool, jabberoo::Presence::Type,
SigC::Marshal<void> >':
/usr/include/jabberoo/roster.hh:322: instantiated from `SigC::
Signal3<void, const std::string&, bool, jabberoo::Presence::Type,
SigC::Marshal<void> >'
/usr/include/jabberoo/roster.hh:322: instantiated from here
/usr/include/sigc++-2.0/sigc++/signal.h:1853: error: no type named
`result_type
' in `struct sigc::internal::signal_emit3<void, const std::string&,
bool,
jabberoo::Presence::Type, SigC::Marshal<void> >'
/usr/include/sigc++-2.0/sigc++/signal.h: In instantiation of `sigc::
signal3<void, const std::string&, bool, jabberoo::Presence::Type,
SigC::Marshal<void> >':
/usr/include/jabberoo/roster.hh:322: instantiated from `SigC::
Signal3<void, const std::string&, bool, jabberoo::Presence::Type,
SigC::Marshal<void> >'
/usr/include/jabberoo/roster.hh:322: instantiated from here
/usr/include/sigc++-2.0/sigc++/signal.h:1888: error: no type named
`result_type
' in `struct sigc::internal::signal_emit3<void, const std::string&,
bool,
jabberoo::Presence::Type, SigC::Marshal<void> >'
/usr/include/sigc++-2.0/sigc++/signal.h:1892: error: no type named
`result_type
' in `struct sigc::internal::signal_emit3<void, const std::string&,
bool,
jabberoo::Presence::Type, SigC::Marshal<void> >'
/usr/include/sigc++-2.0/sigc++/signal.h:1902: error: no type named
`result_type
' in `struct sigc::internal::signal_emit3<void, const std::string&,
bool,
jabberoo::Presence::Type, SigC::Marshal<void> >'
/usr/include/sigc++-2.0/sigc++/signal.h: In instantiation of `SigC::
Signal3<void, const std::string&, bool, jabberoo::Presence::Type,
SigC::Marshal<void> >':
/usr/include/jabberoo/roster.hh:322: instantiated from here
/usr/include/sigc++-2.0/sigc++/signal.h:2883: error: no type named
`result_type
' in `class sigc::signal3<void, const std::string&, bool,
jabberoo::Presence::Type, SigC::Marshal<void> >'
In file included from ../../src/PacketQueue.hh:24,
from ../../src/JabberConnection.hh:25,
from ../../src/GabberApp.hh:26,
from ChatViewManager.cc:23:
/usr/include/sigc++-2.0/sigc++/signal.h: In instantiation of `sigc::
internal::signal_emit2<void, int, const std::string&, SigC::
Marshal<void> >':
/usr/include/sigc++-2.0/sigc++/signal.h:1748: instantiated from `sigc:
:signal2<void, int, const std::string&, SigC::Marshal<void> >'
/usr/include/jabberoo/session.hh:280: instantiated from `SigC::
Signal2<void, int, const std::string&, SigC::Marshal<void> >'
/usr/include/jabberoo/session.hh:280: instantiated from here
/usr/include/sigc++-2.0/sigc++/signal.h:655: error: invalid use of
undefined
type `struct SigC::Marshal<void>'
/usr/include/jabberoo/jabberoofwd.h:40: error: declaration of `struct
SigC::Marshal<void>'
/usr/include/sigc++-2.0/sigc++/signal.h:657: error: invalid use of
undefined
type `struct SigC::Marshal<void>'
/usr/include/jabberoo/jabberoofwd.h:40: error: declaration of `struct
SigC::Marshal<void>'
/usr/include/sigc++-2.0/sigc++/signal.h:684: error: invalid use of
undefined
type `struct SigC::Marshal<void>'
/usr/include/jabberoo/jabberoofwd.h:40: error: declaration of `struct
SigC::Marshal<void>'
/usr/include/sigc++-2.0/sigc++/signal.h: In instantiation of `sigc::
signal2<void, int, const std::string&, SigC::Marshal<void> >':
/usr/include/jabberoo/session.hh:280: instantiated from `SigC::
Signal2<void, int, const std::string&, SigC::Marshal<void> >'
/usr/include/jabberoo/session.hh:280: instantiated from here
/usr/include/sigc++-2.0/sigc++/signal.h:1748: error: no type named
`result_type
' in `struct sigc::internal::signal_emit2<void, int, const std::string&,
SigC::Marshal<void> >'
/usr/include/sigc++-2.0/sigc++/signal.h: In instantiation of `sigc::
signal2<void, int, const std::string&, SigC::Marshal<void> >':
/usr/include/jabberoo/session.hh:280: instantiated from `SigC::
Signal2<void, int, const std::string&, SigC::Marshal<void> >'
/usr/include/jabberoo/session.hh:280: instantiated from here
/usr/include/sigc++-2.0/sigc++/signal.h:1782: error: no type named
`result_type
' in `struct sigc::internal::signal_emit2<void, int, const std::string&,
SigC::Marshal<void> >'
/usr/include/sigc++-2.0/sigc++/signal.h:1786: error: no type named
`result_type
' in `struct sigc::internal::signal_emit2<void, int, const std::string&,
SigC::Marshal<void> >'
/usr/include/sigc++-2.0/sigc++/signal.h:1796: error: no type named
`result_type
' in `struct sigc::internal::signal_emit2<void, int, const std::string&,
SigC::Marshal<void> >'
/usr/include/sigc++-2.0/sigc++/signal.h: In instantiation of `SigC::
Signal2<void, int, const std::string&, SigC::Marshal<void> >':
/usr/include/jabberoo/session.hh:280: instantiated from here
/usr/include/sigc++-2.0/sigc++/signal.h:2831: error: no type named
`result_type
' in `class sigc::signal2<void, int, const std::string&, SigC::
Marshal<void>
>'
/usr/include/sigc++-2.0/sigc++/signal.h: In instantiation of `sigc::
internal::signal_emit1<void, const char*, SigC::Marshal<void> >':
/usr/include/sigc++-2.0/sigc++/signal.h:1645: instantiated from `sigc:
:signal1<void, const char*, SigC::Marshal<void> >'
/usr/include/jabberoo/session.hh:286: instantiated from `SigC::
Signal1<void, const char*, SigC::Marshal<void> >'
/usr/include/jabberoo/session.hh:286: instantiated from here
/usr/include/sigc++-2.0/sigc++/signal.h:525: error: invalid use of
undefined
type `struct SigC::Marshal<void>'
/usr/include/jabberoo/jabberoofwd.h:40: error: declaration of `struct
SigC::Marshal<void>'
/usr/include/sigc++-2.0/sigc++/signal.h:527: error: invalid use of
undefined
type `struct SigC::Marshal<void>'
/usr/include/jabberoo/jabberoofwd.h:40: error: declaration of `struct
SigC::Marshal<void>'
/usr/include/sigc++-2.0/sigc++/signal.h:553: error: invalid use of
undefined
type `struct SigC::Marshal<void>'
/usr/include/jabberoo/jabberoofwd.h:40: error: declaration of `struct
SigC::Marshal<void>'
/usr/include/sigc++-2.0/sigc++/signal.h: In instantiation of `sigc::
signal1<void, const char*, SigC::Marshal<void> >':
/usr/include/jabberoo/session.hh:286: instantiated from `SigC::
Signal1<void, const char*, SigC::Marshal<void> >'
/usr/include/jabberoo/session.hh:286: instantiated from here
/usr/include/sigc++-2.0/sigc++/signal.h:1645: error: no type named
`result_type
' in `struct sigc::internal::signal_emit1<void, const char*,
SigC::Marshal<void> >'
/usr/include/sigc++-2.0/sigc++/signal.h: In instantiation of `sigc::
signal1<void, const char*, SigC::Marshal<void> >':
/usr/include/jabberoo/session.hh:286: instantiated from `SigC::
Signal1<void, const char*, SigC::Marshal<void> >'
/usr/include/jabberoo/session.hh:286: instantiated from here
/usr/include/sigc++-2.0/sigc++/signal.h:1678: error: no type named
`result_type
' in `struct sigc::internal::signal_emit1<void, const char*,
SigC::Marshal<void> >'
/usr/include/sigc++-2.0/sigc++/signal.h:1682: error: no type named
`result_type
' in `struct sigc::internal::signal_emit1<void, const char*,
SigC::Marshal<void> >'
/usr/include/sigc++-2.0/sigc++/signal.h:1692: error: no type named
`result_type
' in `struct sigc::internal::signal_emit1<void, const char*,
SigC::Marshal<void> >'
/usr/include/sigc++-2.0/sigc++/signal.h: In instantiation of `SigC::
Signal1<void, const char*, SigC::Marshal<void> >':
/usr/include/jabberoo/session.hh:286: instantiated from here
/usr/include/sigc++-2.0/sigc++/signal.h:2780: error: no type named
`result_type
' in `class sigc::signal1<void, const char*, SigC::Marshal<void> >'
/usr/include/sigc++-2.0/sigc++/signal.h: In instantiation of `sigc::
internal::signal_emit1<void, const jabberoo::Packet&, SigC::
Marshal<void> >':
/usr/include/sigc++-2.0/sigc++/signal.h:1645: instantiated from `sigc:
:signal1<void, const jabberoo::Packet&, SigC::Marshal<void> >'
/usr/include/jabberoo/session.hh:296: instantiated from `SigC::
Signal1<void, const jabberoo::Packet&, SigC::Marshal<void> >'
/usr/include/jabberoo/session.hh:296: instantiated from here
/usr/include/sigc++-2.0/sigc++/signal.h:525: error: invalid use of
undefined
type `struct SigC::Marshal<void>'
/usr/include/jabberoo/jabberoofwd.h:40: error: declaration of `struct
SigC::Marshal<void>'
/usr/include/sigc++-2.0/sigc++/signal.h:527: error: invalid use of
undefined
type `struct SigC::Marshal<void>'
/usr/include/jabberoo/jabberoofwd.h:40: error: declaration of `struct
SigC::Marshal<void>'
/usr/include/sigc++-2.0/sigc++/signal.h: In instantiation of `sigc::
internal::signal_emit1<void, const jabberoo::Packet&, SigC::
Marshal<void> >':
/usr/include/sigc++-2.0/sigc++/signal.h:1645: instantiated from `sigc:
:signal1<void, const jabberoo::Packet&, SigC::Marshal<void> >'
/usr/include/jabberoo/session.hh:296: instantiated from `SigC::
Signal1<void, const jabberoo::Packet&, SigC::Marshal<void> >'
/usr/include/jabberoo/session.hh:296: instantiated from here
/usr/include/sigc++-2.0/sigc++/signal.h:553: error: invalid use of
undefined
type `struct SigC::Marshal<void>'
/usr/include/jabberoo/jabberoofwd.h:40: error: declaration of `struct
SigC::Marshal<void>'
/usr/include/sigc++-2.0/sigc++/signal.h: In instantiation of `sigc::
signal1<void, const jabberoo::Packet&, SigC::Marshal<void> >':
/usr/include/jabberoo/session.hh:296: instantiated from `SigC::
Signal1<void, const jabberoo::Packet&, SigC::Marshal<void> >'
/usr/include/jabberoo/session.hh:296: instantiated from here
/usr/include/sigc++-2.0/sigc++/signal.h:1645: error: no type named
`result_type
' in `struct sigc::internal::signal_emit1<void, const jabberoo::
Packet&,
SigC::Marshal<void> >'
/usr/include/sigc++-2.0/sigc++/signal.h: In instantiation of `sigc::
signal1<void, const jabberoo::Packet&, SigC::Marshal<void> >':
/usr/include/jabberoo/session.hh:296: instantiated from `SigC::
Signal1<void, const jabberoo::Packet&, SigC::Marshal<void> >'
/usr/include/jabberoo/session.hh:296: instantiated from here
/usr/include/sigc++-2.0/sigc++/signal.h:1678: error: no type named
`result_type
' in `struct sigc::internal::signal_emit1<void, const jabberoo::
Packet&,
SigC::Marshal<void> >'
/usr/include/sigc++-2.0/sigc++/signal.h:1682: error: no type named
`result_type
' in `struct sigc::internal::signal_emit1<void, const jabberoo::
Packet&,
SigC::Marshal<void> >'
/usr/include/sigc++-2.0/sigc++/signal.h:1692: error: no type named
`result_type
' in `struct sigc::internal::signal_emit1<void, const jabberoo::
Packet&,
SigC::Marshal<void> >'
/usr/include/sigc++-2.0/sigc++/signal.h: In instantiation of `SigC::
Signal1<void, const jabberoo::Packet&, SigC::Marshal<void> >':
/usr/include/jabberoo/session.hh:296: instantiated from here
/usr/include/sigc++-2.0/sigc++/signal.h:2780: error: no type named
`result_type
' in `class sigc::signal1<void, const jabberoo::Packet&, SigC::
Marshal<void>
>'
/usr/include/sigc++-2.0/sigc++/signal.h: In instantiation of `sigc::
internal::signal_emit1<void, const judo::Element&, SigC::
Marshal<void> >':
/usr/include/sigc++-2.0/sigc++/signal.h:1645: instantiated from `sigc:
:signal1<void, const judo::Element&, SigC::Marshal<void> >'
/usr/include/jabberoo/session.hh:303: instantiated from `SigC::
Signal1<void, const judo::Element&, SigC::Marshal<void> >'
/usr/include/jabberoo/session.hh:303: instantiated from here
/usr/include/sigc++-2.0/sigc++/signal.h:525: error: invalid use of
undefined
type `struct SigC::Marshal<void>'
/usr/include/jabberoo/jabberoofwd.h:40: error: declaration of `struct
SigC::Marshal<void>'
/usr/include/sigc++-2.0/sigc++/signal.h:527: error: invalid use of
undefined
type `struct SigC::Marshal<void>'
/usr/include/jabberoo/jabberoofwd.h:40: error: declaration of `struct
SigC::Marshal<void>'
/usr/include/sigc++-2.0/sigc++/signal.h: In instantiation of `sigc::
internal::signal_emit1<void, const judo::Element&, SigC::
Marshal<void> >':
/usr/include/sigc++-2.0/sigc++/signal.h:1645: instantiated from `sigc:
:signal1<void, const judo::Element&, SigC::Marshal<void> >'
/usr/include/jabberoo/session.hh:303: instantiated from `SigC::
Signal1<void, const judo::Element&, SigC::Marshal<void> >'
/usr/include/jabberoo/session.hh:303: instantiated from here
/usr/include/sigc++-2.0/sigc++/signal.h:553: error: invalid use of
undefined
type `struct SigC::Marshal<void>'
/usr/include/jabberoo/jabberoofwd.h:40: error: declaration of `struct
SigC::Marshal<void>'
/usr/include/sigc++-2.0/sigc++/signal.h: In instantiation of `sigc::
signal1<void, const judo::Element&, SigC::Marshal<void> >':
/usr/include/jabberoo/session.hh:303: instantiated from `SigC::
Signal1<void, const judo::Element&, SigC::Marshal<void> >'
/usr/include/jabberoo/session.hh:303: instantiated from here
/usr/include/sigc++-2.0/sigc++/signal.h:1645: error: no type named
`result_type
' in `struct sigc::internal::signal_emit1<void, const judo::Element&,
SigC::Marshal<void> >'
/usr/include/sigc++-2.0/sigc++/signal.h: In instantiation of `sigc::
signal1<void, const judo::Element&, SigC::Marshal<void> >':
/usr/include/jabberoo/session.hh:303: instantiated from `SigC::
Signal1<void, const judo::Element&, SigC::Marshal<void> >'
/usr/include/jabberoo/session.hh:303: instantiated from here
/usr/include/sigc++-2.0/sigc++/signal.h:1678: error: no type named
`result_type
' in `struct sigc::internal::signal_emit1<void, const judo::Element&,
SigC::Marshal<void> >'
/usr/include/sigc++-2.0/sigc++/signal.h:1682: error: no type named
`result_type
' in `struct sigc::internal::signal_emit1<void, const judo::Element&,
SigC::Marshal<void> >'
/usr/include/sigc++-2.0/sigc++/signal.h:1692: error: no type named
`result_type
' in `struct sigc::internal::signal_emit1<void, const judo::Element&,
SigC::Marshal<void> >'
/usr/include/sigc++-2.0/sigc++/signal.h: In instantiation of `SigC::
Signal1<void, const judo::Element&, SigC::Marshal<void> >':
/usr/include/jabberoo/session.hh:303: instantiated from here
/usr/include/sigc++-2.0/sigc++/signal.h:2780: error: no type named
`result_type
' in `class sigc::signal1<void, const judo::Element&, SigC::
Marshal<void> >'
/usr/include/sigc++-2.0/sigc++/signal.h: In instantiation of `sigc::
internal::signal_emit1<void, const jabberoo::Message&, SigC::
Marshal<void> >':
/usr/include/sigc++-2.0/sigc++/signal.h:1645: instantiated from `sigc:
:signal1<void, const jabberoo::Message&, SigC::Marshal<void> >'
/usr/include/jabberoo/session.hh:316: instantiated from `SigC::
Signal1<void, const jabberoo::Message&, SigC::Marshal<void> >'
/usr/include/jabberoo/session.hh:316: instantiated from here
/usr/include/sigc++-2.0/sigc++/signal.h:525: error: invalid use of
undefined
type `struct SigC::Marshal<void>'
/usr/include/jabberoo/jabberoofwd.h:40: error: declaration of `struct
SigC::Marshal<void>'
/usr/include/sigc++-2.0/sigc++/signal.h:527: error: invalid use of
undefined
type `struct SigC::Marshal<void>'
/usr/include/jabberoo/jabberoofwd.h:40: error: declaration of `struct
SigC::Marshal<void>'
/usr/include/sigc++-2.0/sigc++/signal.h: In instantiation of `sigc::
internal::signal_emit1<void, const jabberoo::Message&, SigC::
Marshal<void> >':
/usr/include/sigc++-2.0/sigc++/signal.h:1645: instantiated from `sigc:
:signal1<void, const jabberoo::Message&, SigC::Marshal<void> >'
/usr/include/jabberoo/session.hh:316: instantiated from `SigC::
Signal1<void, const jabberoo::Message&, SigC::Marshal<void> >'
/usr/include/jabberoo/session.hh:316: instantiated from here
/usr/include/sigc++-2.0/sigc++/signal.h:553: error: invalid use of
undefined
type `struct SigC::Marshal<void>'
/usr/include/jabberoo/jabberoofwd.h:40: error: declaration of `struct
SigC::Marshal<void>'
/usr/include/sigc++-2.0/sigc++/signal.h: In instantiation of `sigc::
signal1<void, const jabberoo::Message&, SigC::Marshal<void> >':
/usr/include/jabberoo/session.hh:316: instantiated from `SigC::
Signal1<void, const jabberoo::Message&, SigC::Marshal<void> >'
/usr/include/jabberoo/session.hh:316: instantiated from here
/usr/include/sigc++-2.0/sigc++/signal.h:1645: error: no type named
`result_type
' in `struct sigc::internal::signal_emit1<void, const jabberoo::
Message&,
SigC::Marshal<void> >'
/usr/include/sigc++-2.0/sigc++/signal.h: In instantiation of `sigc::
signal1<void, const jabberoo::Message&, SigC::Marshal<void> >':
/usr/include/jabberoo/session.hh:316: instantiated from `SigC::
Signal1<void, const jabberoo::Message&, SigC::Marshal<void> >'
/usr/include/jabberoo/session.hh:316: instantiated from here
/usr/include/sigc++-2.0/sigc++/signal.h:1678: error: no type named
`result_type
' in `struct sigc::internal::signal_emit1<void, const jabberoo::
Message&,
SigC::Marshal<void> >'
/usr/include/sigc++-2.0/sigc++/signal.h:1682: error: no type named
`result_type
' in `struct sigc::internal::signal_emit1<void, const jabberoo::
Message&,
SigC::Marshal<void> >'
/usr/include/sigc++-2.0/sigc++/signal.h:1692: error: no type named
`result_type
' in `struct sigc::internal::signal_emit1<void, const jabberoo::
Message&,
SigC::Marshal<void> >'
/usr/include/sigc++-2.0/sigc++/signal.h: In instantiation of `SigC::
Signal1<void, const jabberoo::Message&, SigC::Marshal<void> >':
/usr/include/jabberoo/session.hh:316: instantiated from here
/usr/include/sigc++-2.0/sigc++/signal.h:2780: error: no type named
`result_type
' in `class sigc::signal1<void, const jabberoo::Message&,
SigC::Marshal<void> >'
/usr/include/sigc++-2.0/sigc++/signal.h: In instantiation of `sigc::
internal::signal_emit1<void, const jabberoo::Presence&, SigC::
Marshal<void> >':
/usr/include/sigc++-2.0/sigc++/signal.h:1645: instantiated from `sigc:
:signal1<void, const jabberoo::Presence&, SigC::Marshal<void> >'
/usr/include/jabberoo/session.hh:329: instantiated from `SigC::
Signal1<void, const jabberoo::Presence&, SigC::Marshal<void> >'
/usr/include/jabberoo/session.hh:329: instantiated from here
/usr/include/sigc++-2.0/sigc++/signal.h:525: error: invalid use of
undefined
type `struct SigC::Marshal<void>'
/usr/include/jabberoo/jabberoofwd.h:40: error: declaration of `struct
SigC::Marshal<void>'
/usr/include/sigc++-2.0/sigc++/signal.h:527: error: invalid use of
undefined
type `struct SigC::Marshal<void>'
/usr/include/jabberoo/jabberoofwd.h:40: error: declaration of `struct
SigC::Marshal<void>'
/usr/include/sigc++-2.0/sigc++/signal.h: In instantiation of `sigc::
internal::signal_emit1<void, const jabberoo::Presence&, SigC::
Marshal<void> >':
/usr/include/sigc++-2.0/sigc++/signal.h:1645: instantiated from `sigc:
:signal1<void, const jabberoo::Presence&, SigC::Marshal<void> >'
/usr/include/jabberoo/session.hh:329: instantiated from `SigC::
Signal1<void, const jabberoo::Presence&, SigC::Marshal<void> >'
/usr/include/jabberoo/session.hh:329: instantiated from here
/usr/include/sigc++-2.0/sigc++/signal.h:553: error: invalid use of
undefined
type `struct SigC::Marshal<void>'
/usr/include/jabberoo/jabberoofwd.h:40: error: declaration of `struct
SigC::Marshal<void>'
/usr/include/sigc++-2.0/sigc++/signal.h: In instantiation of `sigc::
signal1<void, const jabberoo::Presence&, SigC::Marshal<void> >':
/usr/include/jabberoo/session.hh:329: instantiated from `SigC::
Signal1<void, const jabberoo::Presence&, SigC::Marshal<void> >'
/usr/include/jabberoo/session.hh:329: instantiated from here
/usr/include/sigc++-2.0/sigc++/signal.h:1645: error: no type named
`result_type
' in `struct sigc::internal::signal_emit1<void, const jabberoo::
Presence&,
SigC::Marshal<void> >'
/usr/include/sigc++-2.0/sigc++/signal.h: In instantiation of `sigc::
signal1<void, const jabberoo::Presence&, SigC::Marshal<void> >':
/usr/include/jabberoo/session.hh:329: instantiated from `SigC::
Signal1<void, const jabberoo::Presence&, SigC::Marshal<void> >'
/usr/include/jabberoo/session.hh:329: instantiated from here
/usr/include/sigc++-2.0/sigc++/signal.h:1678: error: no type named
`result_type
' in `struct sigc::internal::signal_emit1<void, const jabberoo::
Presence&,
SigC::Marshal<void> >'
/usr/include/sigc++-2.0/sigc++/signal.h:1682: error: no type named
`result_type
' in `struct sigc::internal::signal_emit1<void, const jabberoo::
Presence&,
SigC::Marshal<void> >'
/usr/include/sigc++-2.0/sigc++/signal.h:1692: error: no type named
`result_type
' in `struct sigc::internal::signal_emit1<void, const jabberoo::
Presence&,
SigC::Marshal<void> >'
/usr/include/sigc++-2.0/sigc++/signal.h: In instantiation of `SigC::
Signal1<void, const jabberoo::Presence&, SigC::Marshal<void> >':
/usr/include/jabberoo/session.hh:329: instantiated from here
/usr/include/sigc++-2.0/sigc++/signal.h:2780: error: no type named
`result_type
' in `class sigc::signal1<void, const jabberoo::Presence&,
SigC::Marshal<void> >'
/usr/include/sigc++-2.0/sigc++/signal.h: In instantiation of `sigc::
internal::signal_emit2<void, const jabberoo::Presence&, jabberoo::
Presence::Type, SigC::Marshal<void> >':
/usr/include/sigc++-2.0/sigc++/signal.h:1748: instantiated from `sigc:
:signal2<void, const jabberoo::Presence&, jabberoo::Presence::Type,
SigC::Marshal<void> >'
/usr/include/jabberoo/session.hh:336: instantiated from `SigC::
Signal2<void, const jabberoo::Presence&, jabberoo::Presence::Type,
SigC::Marshal<void> >'
/usr/include/jabberoo/session.hh:336: instantiated from here
/usr/include/sigc++-2.0/sigc++/signal.h:655: error: invalid use of
undefined
type `struct SigC::Marshal<void>'
/usr/include/jabberoo/jabberoofwd.h:40: error: declaration of `struct
SigC::Marshal<void>'
/usr/include/sigc++-2.0/sigc++/signal.h:657: error: invalid use of
undefined
type `struct SigC::Marshal<void>'
/usr/include/jabberoo/jabberoofwd.h:40: error: declaration of `struct
SigC::Marshal<void>'
/usr/include/sigc++-2.0/sigc++/signal.h:684: error: invalid use of
undefined
type `struct SigC::Marshal<void>'
/usr/include/jabberoo/jabberoofwd.h:40: error: declaration of `struct
SigC::Marshal<void>'
/usr/include/sigc++-2.0/sigc++/signal.h: In instantiation of `sigc::
signal2<void, const jabberoo::Presence&, jabberoo::Presence::Type,
SigC::Marshal<void> >':
/usr/include/jabberoo/session.hh:336: instantiated from `SigC::
Signal2<void, const jabberoo::Presence&, jabberoo::Presence::Type,
SigC::Marshal<void> >'
/usr/include/jabberoo/session.hh:336: instantiated from here
/usr/include/sigc++-2.0/sigc++/signal.h:1748: error: no type named
`result_type
' in `struct sigc::internal::signal_emit2<void, const jabberoo::
Presence&,
jabberoo::Presence::Type, SigC::Marshal<void> >'
/usr/include/sigc++-2.0/sigc++/signal.h: In instantiation of `sigc::
signal2<void, const jabberoo::Presence&, jabberoo::Presence::Type,
SigC::Marshal<void> >':
/usr/include/jabberoo/session.hh:336: instantiated from `SigC::
Signal2<void, const jabberoo::Presence&, jabberoo::Presence::Type,
SigC::Marshal<void> >'
/usr/include/jabberoo/session.hh:336: instantiated from here
/usr/include/sigc++-2.0/sigc++/signal.h:1782: error: no type named
`result_type
' in `struct sigc::internal::signal_emit2<void, const jabberoo::
Presence&,
jabberoo::Presence::Type, SigC::Marshal<void> >'
/usr/include/sigc++-2.0/sigc++/signal.h:1786: error: no type named
`result_type
' in `struct sigc::internal::signal_emit2<void, const jabberoo::
Presence&,
jabberoo::Presence::Type, SigC::Marshal<void> >'
/usr/include/sigc++-2.0/sigc++/signal.h:1796: error: no type named
`result_type
' in `struct sigc::internal::signal_emit2<void, const jabberoo::
Presence&,
jabberoo::Presence::Type, SigC::Marshal<void> >'
/usr/include/sigc++-2.0/sigc++/signal.h: In instantiation of `SigC::
Signal2<void, const jabberoo::Presence&, jabberoo::Presence::Type,
SigC::Marshal<void> >':
/usr/include/jabberoo/session.hh:336: instantiated from here
/usr/include/sigc++-2.0/sigc++/signal.h:2831: error: no type named
`result_type
' in `class sigc::signal2<void, const jabberoo::Presence&,
jabberoo::Presence::Type, SigC::Marshal<void> >'
/usr/include/sigc++-2.0/sigc++/signal.h: In instantiation of `sigc::
internal::signal_emit2<void, int, const char*, SigC::Marshal<void>
>':
/usr/include/sigc++-2.0/sigc++/signal.h:1748: instantiated from `sigc:
:signal2<void, int, const char*, SigC::Marshal<void> >'
/usr/include/jabberoo/session.hh:361: instantiated from `SigC::
Signal2<void, int, const char*, SigC::Marshal<void> >'
/usr/include/jabberoo/session.hh:361: instantiated from here
/usr/include/sigc++-2.0/sigc++/signal.h:655: error: invalid use of
undefined
type `struct SigC::Marshal<void>'
/usr/include/jabberoo/jabberoofwd.h:40: error: declaration of `struct
SigC::Marshal<void>'
/usr/include/sigc++-2.0/sigc++/signal.h:657: error: invalid use of
undefined
type `struct SigC::Marshal<void>'
/usr/include/jabberoo/jabberoofwd.h:40: error: declaration of `struct
SigC::Marshal<void>'
/usr/include/sigc++-2.0/sigc++/signal.h:684: error: invalid use of
undefined
type `struct SigC::Marshal<void>'
/usr/include/jabberoo/jabberoofwd.h:40: error: declaration of `struct
SigC::Marshal<void>'
/usr/include/sigc++-2.0/sigc++/signal.h: In instantiation of `sigc::
signal2<void, int, const char*, SigC::Marshal<void> >':
/usr/include/jabberoo/session.hh:361: instantiated from `SigC::
Signal2<void, int, const char*, SigC::Marshal<void> >'
/usr/include/jabberoo/session.hh:361: instantiated from here
/usr/include/sigc++-2.0/sigc++/signal.h:1748: error: no type named
`result_type
' in `struct sigc::internal::signal_emit2<void, int, const char*,
SigC::Marshal<void> >'
/usr/include/sigc++-2.0/sigc++/signal.h: In instantiation of `sigc::
signal2<void, int, const char*, SigC::Marshal<void> >':
/usr/include/jabberoo/session.hh:361: instantiated from `SigC::
Signal2<void, int, const char*, SigC::Marshal<void> >'
/usr/include/jabberoo/session.hh:361: instantiated from here
/usr/include/sigc++-2.0/sigc++/signal.h:1782: error: no type named
`result_type
' in `struct sigc::internal::signal_emit2<void, int, const char*,
SigC::Marshal<void> >'
/usr/include/sigc++-2.0/sigc++/signal.h:1786: error: no type named
`result_type
' in `struct sigc::internal::signal_emit2<void, int, const char*,
SigC::Marshal<void> >'
/usr/include/sigc++-2.0/sigc++/signal.h:1796: error: no type named
`result_type
' in `struct sigc::internal::signal_emit2<void, int, const char*,
SigC::Marshal<void> >'
/usr/include/sigc++-2.0/sigc++/signal.h: In instantiation of `SigC::
Signal2<void, int, const char*, SigC::Marshal<void> >':
/usr/include/jabberoo/session.hh:361: instantiated from here
/usr/include/sigc++-2.0/sigc++/signal.h:2831: error: no type named
`result_type
' in `class sigc::signal2<void, int, const char*, SigC::
Marshal<void> >'
/usr/include/sigc++-2.0/sigc++/signal.h: In instantiation of `sigc::
internal::signal_emit3<void, std::string&, std::string&, std::string&,
SigC::Marshal<void> >':
/usr/include/sigc++-2.0/sigc++/signal.h:1853: instantiated from `sigc:
:signal3<void, std::string&, std::string&, std::string&, SigC::
Marshal<void> >'
/usr/include/jabberoo/session.hh:377: instantiated from `SigC::
Signal3<void, std::string&, std::string&, std::string&, SigC::
Marshal<void> >'
/usr/include/jabberoo/session.hh:377: instantiated from here
/usr/include/sigc++-2.0/sigc++/signal.h:789: error: invalid use of
undefined
type `struct SigC::Marshal<void>'
/usr/include/jabberoo/jabberoofwd.h:40: error: declaration of `struct
SigC::Marshal<void>'
/usr/include/sigc++-2.0/sigc++/signal.h:791: error: invalid use of
undefined
type `struct SigC::Marshal<void>'
/usr/include/jabberoo/jabberoofwd.h:40: error: declaration of `struct
SigC::Marshal<void>'
/usr/include/sigc++-2.0/sigc++/signal.h: In instantiation of `sigc::
internal::signal_emit3<void, std::string&, std::string&, std::string&,
SigC::Marshal<void> >':
/usr/include/sigc++-2.0/sigc++/signal.h:1853: instantiated from `sigc:
:signal3<void, std::string&, std::string&, std::string&, SigC::
Marshal<void> >'
/usr/include/jabberoo/session.hh:377: instantiated from `SigC::
Signal3<void, std::string&, std::string&, std::string&, SigC::
Marshal<void> >'
/usr/include/jabberoo/session.hh:377: instantiated from here
/usr/include/sigc++-2.0/sigc++/signal.h:819: error: invalid use of
undefined
type `struct SigC::Marshal<void>'
/usr/include/jabberoo/jabberoofwd.h:40: error: declaration of `struct
SigC::Marshal<void>'
/usr/include/sigc++-2.0/sigc++/signal.h: In instantiation of `sigc::
signal3<void, std::string&, std::string&, std::string&, SigC::
Marshal<void> >':
/usr/include/jabberoo/session.hh:377: instantiated from `SigC::
Signal3<void, std::string&, std::string&, std::string&, SigC::
Marshal<void> >'
/usr/include/jabberoo/session.hh:377: instantiated from here
/usr/include/sigc++-2.0/sigc++/signal.h:1853: error: no type named
`result_type
' in `struct sigc::internal::signal_emit3<void, std::string&, std::
string&,
std::string&, SigC::Marshal<void> >'
/usr/include/sigc++-2.0/sigc++/signal.h: In instantiation of `sigc::
signal3<void, std::string&, std::string&, std::string&, SigC::
Marshal<void> >':
/usr/include/jabberoo/session.hh:377: instantiated from `SigC::
Signal3<void, std::string&, std::string&, std::string&, SigC::
Marshal<void> >'
/usr/include/jabberoo/session.hh:377: instantiated from here
/usr/include/sigc++-2.0/sigc++/signal.h:1888: error: no type named
`result_type
' in `struct sigc::internal::signal_emit3<void, std::string&, std::
string&,
std::string&, SigC::Marshal<void> >'
/usr/include/sigc++-2.0/sigc++/signal.h:1892: error: no type named
`result_type
' in `struct sigc::internal::signal_emit3<void, std::string&, std::
string&,
std::string&, SigC::Marshal<void> >'
/usr/include/sigc++-2.0/sigc++/signal.h:1902: error: no type named
`result_type
' in `struct sigc::internal::signal_emit3<void, std::string&, std::
string&,
std::string&, SigC::Marshal<void> >'
/usr/include/sigc++-2.0/sigc++/signal.h: In instantiation of `SigC::
Signal3<void, std::string&, std::string&, std::string&, SigC::
Marshal<void> >':
/usr/include/jabberoo/session.hh:377: instantiated from here
/usr/include/sigc++-2.0/sigc++/signal.h:2883: error: no type named
`result_type
' in `class sigc::signal3<void, std::string&, std::string&, std::
string&,
SigC::Marshal<void> >'
/usr/include/sigc++-2.0/sigc++/signal.h: In instantiation of `sigc::
internal::signal_emit1<void, std::string&, SigC::Marshal<void> >':
/usr/include/sigc++-2.0/sigc++/signal.h:1645: instantiated from `sigc:
:signal1<void, std::string&, SigC::Marshal<void> >'
/usr/include/jabberoo/session.hh:382: instantiated from `SigC::
Signal1<void, std::string&, SigC::Marshal<void> >'
/usr/include/jabberoo/session.hh:382: instantiated from here
/usr/include/sigc++-2.0/sigc++/signal.h:525: error: invalid use of
undefined
type `struct SigC::Marshal<void>'
/usr/include/jabberoo/jabberoofwd.h:40: error: declaration of `struct
SigC::Marshal<void>'
/usr/include/sigc++-2.0/sigc++/signal.h:527: error: invalid use of
undefined
type `struct SigC::Marshal<void>'
/usr/include/jabberoo/jabberoofwd.h:40: error: declaration of `struct
SigC::Marshal<void>'
/usr/include/sigc++-2.0/sigc++/signal.h:553: error: invalid use of
undefined
type `struct SigC::Marshal<void>'
/usr/include/jabberoo/jabberoofwd.h:40: error: declaration of `struct
SigC::Marshal<void>'
/usr/include/sigc++-2.0/sigc++/signal.h: In instantiation of `sigc::
signal1<void, std::string&, SigC::Marshal<void> >':
/usr/include/jabberoo/session.hh:382: instantiated from `SigC::
Signal1<void, std::string&, SigC::Marshal<void> >'
/usr/include/jabberoo/session.hh:382: instantiated from here
/usr/include/sigc++-2.0/sigc++/signal.h:1645: error: no type named
`result_type
' in `struct sigc::internal::signal_emit1<void, std::string&,
SigC::Marshal<void> >'
/usr/include/sigc++-2.0/sigc++/signal.h: In instantiation of `sigc::
signal1<void, std::string&, SigC::Marshal<void> >':
/usr/include/jabberoo/session.hh:382: instantiated from `SigC::
Signal1<void, std::string&, SigC::Marshal<void> >'
/usr/include/jabberoo/session.hh:382: instantiated from here
/usr/include/sigc++-2.0/sigc++/signal.h:1678: error: no type named
`result_type
' in `struct sigc::internal::signal_emit1<void, std::string&,
SigC::Marshal<void> >'
/usr/include/sigc++-2.0/sigc++/signal.h:1682: error: no type named
`result_type
' in `struct sigc::internal::signal_emit1<void, std::string&,
SigC::Marshal<void> >'
/usr/include/sigc++-2.0/sigc++/signal.h:1692: error: no type named
`result_type
' in `struct sigc::internal::signal_emit1<void, std::string&,
SigC::Marshal<void> >'
/usr/include/sigc++-2.0/sigc++/signal.h: In instantiation of `SigC::
Signal1<void, std::string&, SigC::Marshal<void> >':
/usr/include/jabberoo/session.hh:382: instantiated from here
/usr/include/sigc++-2.0/sigc++/signal.h:2780: error: no type named
`result_type
' in `class sigc::signal1<void, std::string&, SigC::Marshal<void> >'
/usr/include/sigc++-2.0/sigc++/signal.h: In instantiation of `sigc::
internal::signal_emit2<void, std::string&, std::string&, SigC::
Marshal<void> >':
/usr/include/sigc++-2.0/sigc++/signal.h:1748: instantiated from `sigc:
:signal2<void, std::string&, std::string&, SigC::Marshal<void> >'
/usr/include/jabberoo/session.hh:389: instantiated from `SigC::
Signal2<void, std::string&, std::string&, SigC::Marshal<void> >'
/usr/include/jabberoo/session.hh:389: instantiated from here
/usr/include/sigc++-2.0/sigc++/signal.h:655: error: invalid use of
undefined
type `struct SigC::Marshal<void>'
/usr/include/jabberoo/jabberoofwd.h:40: error: declaration of `struct
SigC::Marshal<void>'
/usr/include/sigc++-2.0/sigc++/signal.h:657: error: invalid use of
undefined
type `struct SigC::Marshal<void>'
/usr/include/jabberoo/jabberoofwd.h:40: error: declaration of `struct
SigC::Marshal<void>'
/usr/include/sigc++-2.0/sigc++/signal.h:684: error: invalid use of
undefined
type `struct SigC::Marshal<void>'
/usr/include/jabberoo/jabberoofwd.h:40: error: declaration of `struct
SigC::Marshal<void>'
/usr/include/sigc++-2.0/sigc++/signal.h: In instantiation of `sigc::
signal2<void, std::string&, std::string&, SigC::Marshal<void> >':
/usr/include/jabberoo/session.hh:389: instantiated from `SigC::
Signal2<void, std::string&, std::string&, SigC::Marshal<void> >'
/usr/include/jabberoo/session.hh:389: instantiated from here
/usr/include/sigc++-2.0/sigc++/signal.h:1748: error: no type named
`result_type
' in `struct sigc::internal::signal_emit2<void, std::string&, std::
string&,
SigC::Marshal<void> >'
/usr/include/sigc++-2.0/sigc++/signal.h: In instantiation of `sigc::
signal2<void, std::string&, std::string&, SigC::Marshal<void> >':
/usr/include/jabberoo/session.hh:389: instantiated from `SigC::
Signal2<void, std::string&, std::string&, SigC::Marshal<void> >'
/usr/include/jabberoo/session.hh:389: instantiated from here
/usr/include/sigc++-2.0/sigc++/signal.h:1782: error: no type named
`result_type
' in `struct sigc::internal::signal_emit2<void, std::string&, std::
string&,
SigC::Marshal<void> >'
/usr/include/sigc++-2.0/sigc++/signal.h:1786: error: no type named
`result_type
' in `struct sigc::internal::signal_emit2<void, std::string&, std::
string&,
SigC::Marshal<void> >'
/usr/include/sigc++-2.0/sigc++/signal.h:1796: error: no type named
`result_type
' in `struct sigc::internal::signal_emit2<void, std::string&, std::
string&,
SigC::Marshal<void> >'
/usr/include/sigc++-2.0/sigc++/signal.h: In instantiation of `SigC::
Signal2<void, std::string&, std::string&, SigC::Marshal<void> >':
/usr/include/jabberoo/session.hh:389: instantiated from here
/usr/include/sigc++-2.0/sigc++/signal.h:2831: error: no type named
`result_type
' in `class sigc::signal2<void, std::string&, std::string&,
SigC::Marshal<void> >'
/usr/include/jabberoo/session.hh: In member function `jabberoo::
Session&
jabberoo::Session::operator<<(const char*)':
/usr/include/jabberoo/session.hh:111: error: no match for call to `(
SigC::Signal1<void, const char*, SigC::Marshal<void> >) (const
char*&)'
In file included from /usr/include/jabberoo/jabberoo.hh:45,
from ../../src/JabberConnection.hh:26,
from ../../src/GabberApp.hh:26,
from ChatViewManager.cc:23:
/usr/include/jabberoo/jabberoo-component.hh: In member function `
jabberoo::ComponentSession& jabberoo::ComponentSession::
operator<<(const
jabberoo::Packet&)':
/usr/include/jabberoo/jabberoo-component.hh:79: error: no match for
call to `(
SigC::Signal1<void, const char*, SigC::Marshal<void> >) (const
char*)'
/usr/include/jabberoo/jabberoo-component.hh: In member function `
jabberoo::ComponentSession& jabberoo::ComponentSession::
operator<<(const
char*)':
/usr/include/jabberoo/jabberoo-component.hh:80: error: no match for
call to `(
SigC::Signal1<void, const char*, SigC::Marshal<void> >) (const
char*&)'
In file included from /usr/include/jabberoo/jabberoo.hh:46,
from ../../src/JabberConnection.hh:26,
from ../../src/GabberApp.hh:26,
from ChatViewManager.cc:23:
/usr/include/sigc++-2.0/sigc++/signal.h: At global scope:
/usr/include/sigc++-2.0/sigc++/signal.h: In instantiation of `sigc::
internal::signal_emit1<void, bool, SigC::Marshal<void> >':
/usr/include/sigc++-2.0/sigc++/signal.h:1645: instantiated from `sigc:
:signal1<void, bool, SigC::Marshal<void> >'
/usr/include/jabberoo/jabberoox.hh:144: instantiated from `SigC::
Signal1<void, bool, SigC::Marshal<void> >'
/usr/include/jabberoo/jabberoox.hh:144: instantiated from here
/usr/include/sigc++-2.0/sigc++/signal.h:525: error: invalid use of
undefined
type `struct SigC::Marshal<void>'
/usr/include/jabberoo/jabberoofwd.h:40: error: declaration of `struct
SigC::Marshal<void>'
/usr/include/sigc++-2.0/sigc++/signal.h:527: error: invalid use of
undefined
type `struct SigC::Marshal<void>'
/usr/include/jabberoo/jabberoofwd.h:40: error: declaration of `struct
SigC::Marshal<void>'
/usr/include/sigc++-2.0/sigc++/signal.h:553: error: invalid use of
undefined
type `struct SigC::Marshal<void>'
/usr/include/jabberoo/jabberoofwd.h:40: error: declaration of `struct
SigC::Marshal<void>'
/usr/include/sigc++-2.0/sigc++/signal.h: In instantiation of `sigc::
signal1<void, bool, SigC::Marshal<void> >':
/usr/include/jabberoo/jabberoox.hh:144: instantiated from `SigC::
Signal1<void, bool, SigC::Marshal<void> >'
/usr/include/jabberoo/jabberoox.hh:144: instantiated from here
/usr/include/sigc++-2.0/sigc++/signal.h:1645: error: no type named
`result_type
' in `struct sigc::internal::signal_emit1<void, bool, SigC::
Marshal<void> >'
/usr/include/sigc++-2.0/sigc++/signal.h: In instantiation of `sigc::
signal1<void, bool, SigC::Marshal<void> >':
/usr/include/jabberoo/jabberoox.hh:144: instantiated from `SigC::
Signal1<void, bool, SigC::Marshal<void> >'
/usr/include/jabberoo/jabberoox.hh:144: instantiated from here
/usr/include/sigc++-2.0/sigc++/signal.h:1678: error: no type named
`result_type
' in `struct sigc::internal::signal_emit1<void, bool, SigC::
Marshal<void> >'
/usr/include/sigc++-2.0/sigc++/signal.h:1682: error: no type named
`result_type
' in `struct sigc::internal::signal_emit1<void, bool, SigC::
Marshal<void> >'
/usr/include/sigc++-2.0/sigc++/signal.h:1692: error: no type named
`result_type
' in `struct sigc::internal::signal_emit1<void, bool, SigC::
Marshal<void> >'
/usr/include/sigc++-2.0/sigc++/signal.h: In instantiation of `SigC::
Signal1<void, bool, SigC::Marshal<void> >':
/usr/include/jabberoo/jabberoox.hh:144: instantiated from here
/usr/include/sigc++-2.0/sigc++/signal.h:2780: error: no type named
`result_type
' in `class sigc::signal1<void, bool, SigC::Marshal<void> >'
ChatViewManager.cc: In constructor `Gabber::ChatViewManager::
ChatViewManager()
':
ChatViewManager.cc:50: error: use of class template `template<class
T_return,
class T_arg1, class T_arg2, class T_arg3, class T_arg4, class
T_arg5, class
T_arg6, class T_arg7> class sigc::slot' as expression
ChatViewManager.cc: In member function `void
Gabber::ChatViewManager::on_menu_item_activate()':
ChatViewManager.cc:107: error: `manage' undeclared (first use this
function)
ChatViewManager.cc:107: error: (Each undeclared identifier is
reported only
once for each function it appears in.)
ChatViewManager.cc: In member function `void
Gabber::ChatViewManager::on_action_menu_item_activate()':
ChatViewManager.cc:112: error: `manage' undeclared (first use this
function)
ChatViewManager.cc: In member function `void
Gabber::ChatViewManager::on_chat_node(const judo::Element&)
':
ChatViewManager.cc:137: error: `manage' undeclared (first use this
function)
make[3]: *** [ChatViewManager.lo] Error 1
make[3]: Leaving directory
`/home/users/krzysiek/rpm/BUILD/Gabber-1.9.4/src/modules'
make[2]: *** [all-recursive] Error 1
make[2]: Leaving directory
`/home/users/krzysiek/rpm/BUILD/Gabber-1.9.4/src'
make[1]: *** [all-recursive] Error 1
make[1]: Leaving directory
`/home/users/krzysiek/rpm/BUILD/Gabber-1.9.4'
make: *** [all] Error 2
b&#322;&#261;d: B&#322;&#281;dny status wyj&#347;cia z /var/tmp/rpm-tmp.20891 (%build)

B&#322;&#281;dy budowania RPM-a:
B&#322;&#281;dny status wyj&#347;cia z /var/tmp/rpm-tmp.20891 (%build)

Discussion