"Could not find qmake" on Solaris 9 Intel

ld67
2004-09-26
2013-03-05
  • ld67
    ld67
    2004-09-26

    Hi all,

    I am trying to install fwbuilder 2 on my Intel box with Solaris 9 on it. I get this errors
    "Could not find qmake" error during the initial configure phase while installing libfwbuilder. I got all the pre-requisite softwares like

    libxml2 v2.4.10 or newer
    libxslt v1.0.7 o newer
    ucd-snmp or net-snmp
    openssl - always use latest version
    QT 3.1.x, 3.2.x, 3.3.x

    (all downloaded from SUN freeware website)

    installed. I did a find for the qmake binary but it is not there.

    It will be great if someone can advise on the above issue. Thanks

    ldd

     
    • Vadim Kurland
      Vadim Kurland
      2004-09-26

      I can only confirm what you know already - you need to install qmake. It either comes as a part of QT package, or may be packaged separately. May be you can find it on the same site you got your QT packages from. I looked on sunfreeware.com and could not find qt there, so you must have downloaded it from somewhere else.

       
    • Paul Adams
      Paul Adams
      2004-09-27

    • Vadim Kurland
      Vadim Kurland
      2004-09-27

      Paul, the second URL is for some other qmake. Fwbuilder needs qmake that is a part of QT

       
    • ld67
      ld67
      2004-09-29

      Alright... The original qt is SFWqt I download from Sun' s companion software website which is referenced by a link in sunfreeware.com. Now I download another qt from http://www.trolltech.com. but when I ran the configure script I get this...

      CC -c -o qglobal.o -I. -Igenerators -Igenerators/unix -Igenerators/win32 -Igenerators/mac -I/usr/local/qt-x11-free-3.3.3/include/qmake -I/usr/local/qt-x11-free-3.3.3/include -I/usr/local/qt-x11-free-3.3.3/include -DQT_NO_TEXTCODEC -DQT_NO_UNICODETABLES -DQT_NO_COMPONENT -DQT_NO_STL -DQT_NO_COMPRESS -I/usr/local/qt-x11-free-3.3.3/mkspecs/solaris-cc -DHAVE_QCONFIG_CPP /usr/local/qt-x11-free-3.3.3/src/tools/qglobal.cpp
      In file included from /usr/include/sys/reg.h:13,
                       from /usr/include/sys/regset.h:24,
                       from /usr/include/sys/ucontext.h:21,
                       from /usr/local/lib/gcc/i386-pc-solaris2.9/3.4.0/include/sys/signal.h:249,
                       from /usr/include/signal.h:27,
                       from /usr/local/qt-x11-free-3.3.3/mkspecs/solaris-cc/qplatformdefs.h:25,
                       from /usr/local/qt-x11-free-3.3.3/src/tools/qglobal.cpp:38:
      /usr/include/ia32/sys/reg.h:300: error: `upad128_t' does not name a type
      /usr/include/ia32/sys/reg.h:301: error: `upad128_t' does not name a type
      /usr/include/ia32/sys/reg.h:331: error: `upad128_t' does not name a type
      make: *** [qglobal.o] Error 1
      qmake failed to build. Aborting.

      I set CC to /usr/local/bin/gcc. Anyone knows this..Thanks?

       
    • ld67
      ld67
      2004-10-03

      Hi all,

      I could install the qmake package finally and I got the autogen script in libfwbuilder to run successfully. But when I run make all in the libfwvuilder directory, I get the following errors.

      CC -c -g -Wno-unused-parameter -KPIC   -I/usr/local/qt/mkspecs/default -I. -I.. -I../.. -I/usr/include -I/usr/local/include/libxml2 -I/usr/local/include -I-D_REENTRANT -I-pthreads -I.ui/ -o .obj/dns.o dns.cpp
      CC: Warning: Option -Wno-unused-parameter passed to ld, if ld is invoked, ignored otherwise
      "/usr/include/iso/math_iso.h", line 15: Warning (Anachronism): Attempt to redefine __P without using #undef.
      "../fwbuilder/Logger.h", line 90: Warning: libfwbuilder::NullLogger::operator<<hides the virtual function libfwbuilder::Logger::operator<<(libfwbuilder::Logger&(*)(libfwbuilder::Logger&)).
      "../fwbuilder/Logger.h", line 110: Warning: libfwbuilder::QueueLogger::operator<<hides the virtual function libfwbuilder::Logger::operator<<(libfwbuilder::Logger&(*)(libfwbuilder::Logger&)).
      "dns.cpp", line 392: Warning: stop_program hides libfwbuilder::BackgroundOp::stop_program.
      "dns.cpp", line 408: Warning: String literal converted to char* in formal argument str in call to libfwbuilder::Logger::operator<<(char*).
      "dns.cpp", line 408: Warning: String literal converted to char* in formal argument str in call to libfwbuilder::Logger::operator<<(char*).
      "dns.cpp", line 461: Error: Could not find a match for std::multimap<std::string, libfwbuilder::IPAddress, std::less<std::string>, std::allocator<std::pair<const std::string, libfwbuilder::IPAddress>>>::insert(std::pair<std::string, libfwbuilder::IPAddress>).
      "dns.cpp", line 465: Warning: String literal converted to char* in formal argument str in call to libfwbuilder::Logger::operator<<(char*).
      "dns.cpp", line 465: Warning: String literal converted to char* in formal argument str in call to libfwbuilder::Logger::operator<<(char*).
      "dns.cpp", line 476: Warning: stop_program hides libfwbuilder::BackgroundOp::stop_program.
      "dns.cpp", line 482: Warning: String literal converted to char* in formal argument str in call to libfwbuilder::Logger::operator<<(char*).
      "dns.cpp", line 500: Warning: String literal converted to char* in formal argument str in call to libfwbuilder::Logger::operator<<(char*).
      "dns.cpp", line 501: Warning: String literal converted to char* in formal argument str in call to libfwbuilder::Logger::operator<<(char*).
      "dns.cpp", line 501: Warning: String literal converted to char* in formal argument str in call to libfwbuilder::Logger::operator<<(char*).
      "dns.cpp", line 502: Warning: String literal converted to char* in formal argument str in call to libfwbuilder::Logger::operator<<(char*).
      "dns.cpp", line 502: Warning: String literal converted to char* in formal argument str in call to libfwbuilder::Logger::operator<<(char*).
      "dns.cpp", line 503: Warning: String literal converted to char* in formal argument str in call to libfwbuilder::Logger::operator<<(char*).
      "dns.cpp", line 508: Warning: String literal converted to char* in formal argument str in call to libfwbuilder::Logger::operator<<(char*).
      "dns.cpp", line 523: Warning: stop_program hides libfwbuilder::BackgroundOp::stop_program.
      "dns.cpp", line 529: Warning: String literal converted to char* in formal argument str in call to libfwbuilder::Logger::operator<<(char*).
      "dns.cpp", line 593: Warning: String literal converted to char* in formal argument str in call to libfwbuilder::Logger::operator<<(char*).
      "dns.cpp", line 601: Warning: String literal converted to char* in formal argument str in call to libfwbuilder::Logger::operator<<(char*).
      "dns.cpp", line 724: Warning: String literal converted to char* in formal argument str in call to libfwbuilder::Logger::operator<<(char*).
      "dns.cpp", line 724: Warning: String literal converted to char* in formal argument str in call to libfwbuilder::Logger::operator<<(char*).
      "dns.cpp", line 737: Warning: stop_program hides libfwbuilder::BackgroundOp::stop_program.
      "dns.cpp", line 762: Warning: stop_program hides libfwbuilder::BackgroundOp::stop_program.
      "dns.cpp", line 806: Warning: String literal converted to char* in formal argument str in call to libfwbuilder::Logger::operator<<(char*).
      "dns.cpp", line 807: Warning: String literal converted to char* in formal argument str in call to libfwbuilder::Logger::operator<<(char*).
      "dns.cpp", line 807: Warning: String literal converted to char* in formal argument str in call to libfwbuilder::Logger::operator<<(char*).
      "dns.cpp", line 840: Warning: String literal converted to char* in formal argument str in call to libfwbuilder::Logger::operator<<(char*).
      "dns.cpp", line 851: Warning: stop_program hides libfwbuilder::BackgroundOp::stop_program.
      "dns.cpp", line 862: Warning: String literal converted to char* in formal argument str in call to libfwbuilder::Logger::operator<<(char*).
      "dns.cpp", line 862: Warning: String literal converted to char* in formal argument str in call to libfwbuilder::Logger::operator<<(char*).
      "dns.cpp", line 867: Warning (Anachronism): Formal argument 3 of type extern "C" void*(*)(void*) in call to pthread_create(unsigned*, const _pthread_attr*, extern "C" void*(*)(void*), void*) is being passed void*(*)(void*).
      1 Error(s) and 33 Warning(s) detected.
      make[2]: *** [.obj/dns.o] Error 1
      make[2]: Leaving directory `/opt/solfwbuilder/libfwbuilder-2.0.2/src/fwbuilder'
      make[1]: *** [sub-fwbuilder] Error 2
      make[1]: Leaving directory `/opt/solfwbuilder/libfwbuilder-2.0.2/src'
      make: *** [sub-src] Error 2

      And here is my configure log.

      This file contains any messages produced by compilers while
      running configure, to aid debugging if configure makes a mistake.

      It was created by configure, which was
      generated by GNU Autoconf 2.57.  Invocation command line was

        $ ./configure

      ## --------- ##
      ## Platform. ##
      ## --------- ##

      hostname = solaris
      uname -m = i86pc
      uname -r = 5.9
      uname -s = SunOS
      uname -v = Generic_117172-05

      /usr/bin/uname -p = i386
      /bin/uname -X     = System = SunOS
      Node = solaris
      Release = 5.9
      KernelID = Generic_117172-05
      Machine = i86pc
      BusType = <unknown>
      Serial = <unknown>
      Users = <unknown>
      OEM# = 0
      Origin# = 1
      NumCPU = 1

      /bin/arch              = i86pc
      /usr/bin/arch -k       = i86pc
      /usr/convex/getsysinfo = unknown
      hostinfo               = unknown
      /bin/machine           = unknown
      /usr/bin/oslevel       = unknown
      /bin/universe          = unknown

      PATH: /usr/local/bin
      PATH: /usr/ccs/bin
      PATH: /usr/local/qt/bin
      PATH: /usr/bin
      PATH: /usr/local/bin
      PATH: /usr/ccs/bin
      PATH: /usr/local/qt/bin
      PATH: /usr/sbin
      PATH: /usr/bin
      PATH: /usr/openwin/bin
      PATH: /bin
      PATH: /usr/ucb
      PATH: /usr/local/lib/oss/bin
      PATH: /usr/X11R6/bin
      PATH: /usr/ucb
      PATH: /usr/sfw/bin
      PATH: /opt/Acrobat4/bin
      PATH: /sbin
      PATH: /opt/sfw/bin
      PATH: /opt/sfw/kde/bin
      PATH: /usr/local/lib/oss/sbin
      PATH: /usr/local/lib/oss/bin
      PATH: /usr/dt/bin
      PATH: /usr/openwin/bin
      PATH: /usr/local/lib/oss/bin
      PATH: /usr/X11R6/bin
      PATH: /usr/ucb
      PATH: /usr/sfw/bin
      PATH: /opt/Acrobat4/bin
      PATH: /sbin
      PATH: /opt/sfw/bin
      PATH: /opt/sfw/kde/bin
      PATH: /usr/local/lib/oss/sbin
      PATH: /usr/local/lib/oss/bin

      ## ----------- ##
      ## Core tests. ##
      ## ----------- ##

      configure:1318: checking build system type
      configure:1336: result: i386-pc-solaris2.9
      configure:1344: checking host system type
      configure:1358: result: i386-pc-solaris2.9
      configure:1366: checking target system type
      configure:1380: result: i386-pc-solaris2.9
      configure:1409: checking for a BSD-compatible install
      configure:1463: result: ./install.sh -c
      configure:1502: checking looking for QT
      configure:1516: result: /usr/local/qt
      configure:1525: checking for qmake
      configure:1543: found /usr/local/qt/bin/qmake
      configure:1555: result: /usr/local/qt/bin/qmake
      configure:1645: checking for gcc
      configure:1661: found /usr/local/bin/gcc
      configure:1671: result: gcc
      configure:1915: checking for C compiler version
      configure:1918: gcc --version </dev/null >&5
      gcc (GCC) 3.4.0
      Copyright (C) 2004 Free Software Foundation, Inc.
      This is free software; see the source for copying conditions.  There is NO
      warranty; not even for MERCHANTABILITY or FITNESS FOR A PARTICULAR PURPOSE.

      configure:1921: $? = 0
      configure:1923: gcc -v </dev/null >&5
      Reading specs from /usr/local/lib/gcc/i386-pc-solaris2.9/3.4.0/specs
      Configured with: ../configure --with-as=/usr/ccs/bin/as --with-ld=/usr/ccs/bin/ld --disable-nls
      Thread model: posix
      gcc version 3.4.0
      configure:1926: $? = 0
      configure:1928: gcc -V </dev/null >&5
      gcc: `-V' option must have argument
      configure:1931: $? = 1
      configure:1955: checking for C compiler default output
      configure:1958: gcc    conftest.c  >&5
      configure:1961: $? = 0
      configure:2007: result: a.out
      configure:2012: checking whether the C compiler works
      configure:2018: ./a.out
      configure:2021: $? = 0
      configure:2038: result: yes
      configure:2045: checking whether we are cross compiling
      configure:2047: result: no
      configure:2050: checking for suffix of executables
      configure:2052: gcc -o conftest    conftest.c  >&5
      configure:2055: $? = 0
      configure:2080: result:
      configure:2086: checking for suffix of object files
      configure:2108: gcc -c   conftest.c >&5
      configure:2111: $? = 0
      configure:2133: result: o
      configure:2137: checking whether we are using the GNU C compiler
      configure:2162: gcc -c   conftest.c >&5
      configure:2165: $? = 0
      configure:2168: test -s conftest.o
      configure:2171: $? = 0
      configure:2184: result: yes
      configure:2190: checking whether gcc accepts -g
      configure:2212: gcc -c -g  conftest.c >&5
      configure:2215: $? = 0
      configure:2218: test -s conftest.o
      configure:2221: $? = 0
      configure:2232: result: yes
      configure:2249: checking for gcc option to accept ANSI C
      configure:2310: gcc  -c -g -O2  conftest.c >&5
      configure:2313: $? = 0
      configure:2316: test -s conftest.o
      configure:2319: $? = 0
      configure:2337: result: none needed
      configure:2355: gcc -c -g -O2  conftest.c >&5
      conftest.c:2: error: parse error before "me"
      configure:2358: $? = 1
      configure: failed program was:
      | #ifndef __cplusplus
      |   choke me
      | #endif
      configure:2469: checking for strerror in -lcposix
      configure:2500: gcc -o conftest -g -O2   conftest.c -lcposix   >&5
      ld: fatal: library -lcposix: not found
      ld: fatal: File processing errors. No output written to conftest
      collect2: ld returned 1 exit status
      configure:2503: $? = 1
      configure: failed program was:
      | #line 2476 "configure"
      | /* confdefs.h.  */
      |
      | #define PACKAGE_NAME ""
      | #define PACKAGE_TARNAME ""
      | #define PACKAGE_VERSION ""
      | #define PACKAGE_STRING ""
      | #define PACKAGE_BUGREPORT ""
      | #define LIBFWBUILDER_FORMAT_VERSION "2.0.2"
      | /* end confdefs.h.  */
      |
      | /* Override any gcc2 internal prototype to avoid an error.  */
      | #ifdef __cplusplus
      | extern "C"
      | #endif
      | /* We use char because int might match the return type of a gcc2
      |    builtin and then its argument prototype would still apply.  */
      | char strerror ();
      | int
      | main ()
      | {
      | strerror ();
      |   ;
      |   return 0;
      | }
      configure:2521: result: no
      configure:2575: checking for gcc
      configure:2601: result: gcc
      configure:2845: checking for C compiler version
      configure:2848: gcc --version </dev/null >&5
      gcc (GCC) 3.4.0
      Copyright (C) 2004 Free Software Foundation, Inc.
      This is free software; see the source for copying conditions.  There is NO
      warranty; not even for MERCHANTABILITY or FITNESS FOR A PARTICULAR PURPOSE.

      configure:2851: $? = 0
      configure:2853: gcc -v </dev/null >&5
      Reading specs from /usr/local/lib/gcc/i386-pc-solaris2.9/3.4.0/specs
      Configured with: ../configure --with-as=/usr/ccs/bin/as --with-ld=/usr/ccs/bin/ld --disable-nls
      Thread model: posix
      gcc version 3.4.0
      configure:2856: $? = 0
      configure:2858: gcc -V </dev/null >&5
      gcc: `-V' option must have argument
      configure:2861: $? = 1
      configure:2864: checking whether we are using the GNU C compiler
      configure:2911: result: yes
      configure:2917: checking whether gcc accepts -g
      configure:2959: result: yes
      configure:2976: checking for gcc option to accept ANSI C
      configure:3064: result: none needed
      configure:3082: gcc -c -g -O2  conftest.c >&5
      conftest.c:2: error: parse error before "me"
      configure:3085: $? = 1
      configure: failed program was:
      | #ifndef __cplusplus
      |   choke me
      | #endif
      configure:3199: checking how to run the C preprocessor
      configure:3235: gcc -E  conftest.c
      configure:3241: $? = 0
      configure:3273: gcc -E  conftest.c
      configure:3273:28: ac_nonexistent.h: No such file or directory
      configure:3279: $? = 1
      configure: failed program was:
      | #line 3264 "configure"
      | /* confdefs.h.  */
      |
      | #define PACKAGE_NAME ""
      | #define PACKAGE_TARNAME ""
      | #define PACKAGE_VERSION ""
      | #define PACKAGE_STRING ""
      | #define PACKAGE_BUGREPORT ""
      | #define LIBFWBUILDER_FORMAT_VERSION "2.0.2"
      | /* end confdefs.h.  */
      | #include <ac_nonexistent.h>
      configure:3317: result: gcc -E
      configure:3342: gcc -E  conftest.c
      configure:3348: $? = 0
      configure:3380: gcc -E  conftest.c
      configure:3380:28: ac_nonexistent.h: No such file or directory
      configure:3386: $? = 1
      configure: failed program was:
      | #line 3371 "configure"
      | /* confdefs.h.  */
      |
      | #define PACKAGE_NAME ""
      | #define PACKAGE_TARNAME ""
      | #define PACKAGE_VERSION ""
      | #define PACKAGE_STRING ""
      | #define PACKAGE_BUGREPORT ""
      | #define LIBFWBUILDER_FORMAT_VERSION "2.0.2"
      | /* end confdefs.h.  */
      | #include <ac_nonexistent.h>
      configure:3429: checking for egrep
      configure:3439: result: egrep
      configure:3444: checking for ANSI C header files
      configure:3470: gcc -c -g -O2  conftest.c >&5
      configure:3473: $? = 0
      configure:3476: test -s conftest.o
      configure:3479: $? = 0
      configure:3568: gcc -o conftest -g -O2   conftest.c  >&5
      configure:3571: $? = 0
      configure:3573: ./conftest
      configure:3576: $? = 0
      configure:3591: result: yes
      configure:3606: checking how to run the C preprocessor
      configure:3724: result: gcc -E
      configure:3749: gcc -E  conftest.c
      configure:3755: $? = 0
      configure:3787: gcc -E  conftest.c
      configure:3788:28: ac_nonexistent.h: No such file or directory
      configure:3793: $? = 1
      configure: failed program was:
      | #line 3778 "configure"
      | /* confdefs.h.  */
      |
      | #define PACKAGE_NAME ""
      | #define PACKAGE_TARNAME ""
      | #define PACKAGE_VERSION ""
      | #define PACKAGE_STRING ""
      | #define PACKAGE_BUGREPORT ""
      | #define LIBFWBUILDER_FORMAT_VERSION "2.0.2"
      | #define STDC_HEADERS 1
      | /* end confdefs.h.  */
      | #include <ac_nonexistent.h>
      configure:3887: checking for g++
      configure:3903: found /usr/local/bin/g++
      configure:3913: result: g++
      configure:3929: checking for C++ compiler version
      configure:3932: g++ --version </dev/null >&5
      g++ (GCC) 3.4.0
      Copyright (C) 2004 Free Software Foundation, Inc.
      This is free software; see the source for copying conditions.  There is NO
      warranty; not even for MERCHANTABILITY or FITNESS FOR A PARTICULAR PURPOSE.

      configure:3935: $? = 0
      configure:3937: g++ -v </dev/null >&5
      Reading specs from /usr/local/lib/gcc/i386-pc-solaris2.9/3.4.0/specs
      Configured with: ../configure --with-as=/usr/ccs/bin/as --with-ld=/usr/ccs/bin/ld --disable-nls
      Thread model: posix
      gcc version 3.4.0
      configure:3940: $? = 0
      configure:3942: g++ -V </dev/null >&5
      g++: `-V' option must have argument
      configure:3945: $? = 1
      configure:3948: checking whether we are using the GNU C++ compiler
      configure:3973: g++ -c   conftest.cc >&5
      configure:3976: $? = 0
      configure:3979: test -s conftest.o
      configure:3982: $? = 0
      configure:3995: result: yes
      configure:4001: checking whether g++ accepts -g
      configure:4023: g++ -c -g  conftest.cc >&5
      configure:4026: $? = 0
      configure:4029: test -s conftest.o
      configure:4032: $? = 0
      configure:4043: result: yes
      configure:4087: g++ -c -g -O2  conftest.cc >&5
      configure:4090: $? = 0
      configure:4093: test -s conftest.o
      configure:4096: $? = 0
      configure:4123: g++ -c -g -O2  conftest.cc >&5
      configure: In function `int main()':
      configure:4120: error: `exit' undeclared (first use this function)
      configure:4120: error: (Each undeclared identifier is reported only once for each function it appears in.)
      configure:4126: $? = 1
      configure: failed program was:
      | #line 4106 "configure"
      | /* confdefs.h.  */
      |
      | #define PACKAGE_NAME ""
      | #define PACKAGE_TARNAME ""
      | #define PACKAGE_VERSION ""
      | #define PACKAGE_STRING ""
      | #define PACKAGE_BUGREPORT ""
      | #define LIBFWBUILDER_FORMAT_VERSION "2.0.2"
      | #define STDC_HEADERS 1
      | /* end confdefs.h.  */
      |
      | int
      | main ()
      | {
      | exit (42);
      |   ;
      |   return 0;
      | }
      configure:4087: g++ -c -g -O2  conftest.cc >&5
      configure:4090: $? = 0
      configure:4093: test -s conftest.o
      configure:4096: $? = 0
      configure:4123: g++ -c -g -O2  conftest.cc >&5
      configure:4126: $? = 0
      configure:4129: test -s conftest.o
      configure:4132: $? = 0
      configure:4160: checking how to run the C++ preprocessor
      configure:4192: g++ -E  conftest.cc
      configure:4198: $? = 0
      configure:4230: g++ -E  conftest.cc
      configure:4234:28: ac_nonexistent.h: No such file or directory
      configure:4236: $? = 1
      configure: failed program was:
      | #line 4221 "configure"
      | /* confdefs.h.  */
      |
      | #define PACKAGE_NAME ""
      | #define PACKAGE_TARNAME ""
      | #define PACKAGE_VERSION ""
      | #define PACKAGE_STRING ""
      | #define PACKAGE_BUGREPORT ""
      | #define LIBFWBUILDER_FORMAT_VERSION "2.0.2"
      | #define STDC_HEADERS 1
      | #ifdef __cplusplus
      | #include <stdlib.h>
      | #endif
      | /* end confdefs.h.  */
      | #include <ac_nonexistent.h>
      configure:4274: result: g++ -E
      configure:4299: g++ -E  conftest.cc
      configure:4305: $? = 0
      configure:4337: g++ -E  conftest.cc
      configure:4341:28: ac_nonexistent.h: No such file or directory
      configure:4343: $? = 1
      configure: failed program was:
      | #line 4328 "configure"
      | /* confdefs.h.  */
      |
      | #define PACKAGE_NAME ""
      | #define PACKAGE_TARNAME ""
      | #define PACKAGE_VERSION ""
      | #define PACKAGE_STRING ""
      | #define PACKAGE_BUGREPORT ""
      | #define LIBFWBUILDER_FORMAT_VERSION "2.0.2"
      | #define STDC_HEADERS 1
      | #ifdef __cplusplus
      | #include <stdlib.h>
      | #endif
      | /* end confdefs.h.  */
      | #include <ac_nonexistent.h>
      configure:4386: checking whether byte ordering is bigendian
      configure:4414: gcc -c -g -O2  conftest.c >&5
      configure: In function `main':
      configure:4412: error: `bogus' undeclared (first use in this function)
      configure:4412: error: (Each undeclared identifier is reported only once
      configure:4412: error: for each function it appears in.)
      configure:4412: error: parse error before "endian"
      configure:4417: $? = 1
      configure: failed program was:
      | #line 4392 "configure"
      | /* confdefs.h.  */
      |
      | #define PACKAGE_NAME ""
      | #define PACKAGE_TARNAME ""
      | #define PACKAGE_VERSION ""
      | #define PACKAGE_STRING ""
      | #define PACKAGE_BUGREPORT ""
      | #define LIBFWBUILDER_FORMAT_VERSION "2.0.2"
      | #define STDC_HEADERS 1
      | #ifdef __cplusplus
      | #include <stdlib.h>
      | #endif
      | /* end confdefs.h.  */
      | #include <sys/types.h>
      | #include <sys/param.h>
      |
      | int
      | main ()
      | {
      | #if !BYTE_ORDER || !BIG_ENDIAN || !LITTLE_ENDIAN
      |  bogus endian macros
      | #endif
      |
      |   ;
      |   return 0;
      | }
      configure:4547: gcc -o conftest -g -O2   conftest.c  >&5
      configure:4550: $? = 0
      configure:4552: ./conftest
      configure:4555: $? = 0
      configure:4571: result: no
      configure:4594: checking whether make sets $(MAKE)
      configure:4614: result: yes
      configure:4631: checking for strtok_r
      configure:4681: gcc -o conftest -g -O2   conftest.c  >&5
      configure:4684: $? = 0
      configure:4687: test -s conftest
      configure:4690: $? = 0
      configure:4701: result: yes
      configure:4725: checking for sys/types.h
      configure:4742: gcc -c -g -O2  conftest.c >&5
      configure:4745: $? = 0
      configure:4748: test -s conftest.o
      configure:4751: $? = 0
      configure:4762: result: yes
      configure:4725: checking for sys/stat.h
      configure:4742: gcc -c -g -O2  conftest.c >&5
      configure:4745: $? = 0
      configure:4748: test -s conftest.o
      configure:4751: $? = 0
      configure:4762: result: yes
      configure:4725: checking for stdlib.h
      configure:4742: gcc -c -g -O2  conftest.c >&5
      configure:4745: $? = 0
      configure:4748: test -s conftest.o
      configure:4751: $? = 0
      configure:4762: result: yes
      configure:4725: checking for string.h
      configure:4742: gcc -c -g -O2  conftest.c >&5
      configure:4745: $? = 0
      configure:4748: test -s conftest.o
      configure:4751: $? = 0
      configure:4762: result: yes
      configure:4725: checking for memory.h
      configure:4742: gcc -c -g -O2  conftest.c >&5
      configure:4745: $? = 0
      configure:4748: test -s conftest.o
      configure:4751: $? = 0
      configure:4762: result: yes
      configure:4725: checking for strings.h
      configure:4742: gcc -c -g -O2  conftest.c >&5
      configure:4745: $? = 0
      configure:4748: test -s conftest.o
      configure:4751: $? = 0
      configure:4762: result: yes
      configure:4725: checking for inttypes.h
      configure:4742: gcc -c -g -O2  conftest.c >&5
      configure:4745: $? = 0
      configure:4748: test -s conftest.o
      configure:4751: $? = 0
      configure:4762: result: yes
      configure:4725: checking for stdint.h
      configure:4742: gcc -c -g -O2  conftest.c >&5
      configure:4787:20: stdint.h: No such file or directory
      configure:4745: $? = 1
      configure: failed program was:
      | #line 4730 "configure"
      | /* confdefs.h.  */
      |
      | #define PACKAGE_NAME ""
      | #define PACKAGE_TARNAME ""
      | #define PACKAGE_VERSION ""
      | #define PACKAGE_STRING ""
      | #define PACKAGE_BUGREPORT ""
      | #define LIBFWBUILDER_FORMAT_VERSION "2.0.2"
      | #define STDC_HEADERS 1
      | #ifdef __cplusplus
      | #include <stdlib.h>
      | #endif
      | #define WORDS_LITTLEENDIAN 1
      | #define HAVE_STRTOK_R 1
      | #define HAVE_SYS_TYPES_H 1
      | #define HAVE_SYS_STAT_H 1
      | #define HAVE_STDLIB_H 1
      | #define HAVE_STRING_H 1
      | #define HAVE_MEMORY_H 1
      | #define HAVE_STRINGS_H 1
      | #define HAVE_INTTYPES_H 1
      | /* end confdefs.h.  */
      | #include <stdio.h>
      | #if HAVE_SYS_TYPES_H
      | # include <sys/types.h>
      | #endif
      | #if HAVE_SYS_STAT_H
      | # include <sys/stat.h>
      | #endif
      | #if STDC_HEADERS
      | # include <stdlib.h>
      | # include <stddef.h>
      | #else
      | # if HAVE_STDLIB_H
      | #  include <stdlib.h>
      | # endif
      | #endif
      | #if HAVE_STRING_H
      | # if !STDC_HEADERS && HAVE_MEMORY_H
      | #  include <memory.h>
      | # endif
      | # include <string.h>
      | #endif
      | #if HAVE_STRINGS_H
      | # include <strings.h>
      | #endif
      | #if HAVE_INTTYPES_H
      | # include <inttypes.h>
      | #else
      | # if HAVE_STDINT_H
      | #  include <stdint.h>
      | # endif
      | #endif
      | #if HAVE_UNISTD_H
      | # include <unistd.h>
      | #endif
      |
      | #include <stdint.h>
      configure:4762: result: no
      configure:4725: checking for unistd.h
      configure:4742: gcc -c -g -O2  conftest.c >&5
      configure:4745: $? = 0
      configure:4748: test -s conftest.o
      configure:4751: $? = 0
      configure:4762: result: yes
      configure:4788: checking endian.h usability
      configure:4801: gcc -c -g -O2  conftest.c >&5
      configure:4847:20: endian.h: No such file or directory
      configure:4804: $? = 1
      configure: failed program was:
      | #line 4790 "configure"
      | /* confdefs.h.  */
      |
      | #define PACKAGE_NAME ""
      | #define PACKAGE_TARNAME ""
      | #define PACKAGE_VERSION ""
      | #define PACKAGE_STRING ""
      | #define PACKAGE_BUGREPORT ""
      | #define LIBFWBUILDER_FORMAT_VERSION "2.0.2"
      | #define STDC_HEADERS 1
      | #ifdef __cplusplus
      | #include <stdlib.h>
      | #endif
      | #define WORDS_LITTLEENDIAN 1
      | #define HAVE_STRTOK_R 1
      | #define HAVE_SYS_TYPES_H 1
      | #define HAVE_SYS_STAT_H 1
      | #define HAVE_STDLIB_H 1
      | #define HAVE_STRING_H 1
      | #define HAVE_MEMORY_H 1
      | #define HAVE_STRINGS_H 1
      | #define HAVE_INTTYPES_H 1
      | #define HAVE_UNISTD_H 1
      | /* end confdefs.h.  */
      | #include <stdio.h>
      | #if HAVE_SYS_TYPES_H
      | # include <sys/types.h>
      | #endif
      | #if HAVE_SYS_STAT_H
      | # include <sys/stat.h>
      | #endif
      | #if STDC_HEADERS
      | # include <stdlib.h>
      | # include <stddef.h>
      | #else
      | # if HAVE_STDLIB_H
      | #  include <stdlib.h>
      | # endif
      | #endif
      | #if HAVE_STRING_H
      | # if !STDC_HEADERS && HAVE_MEMORY_H
      | #  include <memory.h>
      | # endif
      | # include <string.h>
      | #endif
      | #if HAVE_STRINGS_H
      | # include <strings.h>
      | #endif
      | #if HAVE_INTTYPES_H
      | # include <inttypes.h>
      | #else
      | # if HAVE_STDINT_H
      | #  include <stdint.h>
      | # endif
      | #endif
      | #if HAVE_UNISTD_H
      | # include <unistd.h>
      | #endif
      | #include <endian.h>
      configure:4820: result: no
      configure:4824: checking endian.h presence
      configure:4835: gcc -E  conftest.c
      configure:4849:20: endian.h: No such file or directory
      configure:4841: $? = 1
      configure: failed program was:
      | #line 4826 "configure"
      | /* confdefs.h.  */
      |
      | #define PACKAGE_NAME ""
      | #define PACKAGE_TARNAME ""
      | #define PACKAGE_VERSION ""
      | #define PACKAGE_STRING ""
      | #define PACKAGE_BUGREPORT ""
      | #define LIBFWBUILDER_FORMAT_VERSION "2.0.2"
      | #define STDC_HEADERS 1
      | #ifdef __cplusplus
      | #include <stdlib.h>
      | #endif
      | #define WORDS_LITTLEENDIAN 1
      | #define HAVE_STRTOK_R 1
      | #define HAVE_SYS_TYPES_H 1
      | #define HAVE_SYS_STAT_H 1
      | #define HAVE_STDLIB_H 1
      | #define HAVE_STRING_H 1
      | #define HAVE_MEMORY_H 1
      | #define HAVE_STRINGS_H 1
      | #define HAVE_INTTYPES_H 1
      | #define HAVE_UNISTD_H 1
      | /* end confdefs.h.  */
      | #include <endian.h>
      configure:4860: result: no
      configure:4896: checking for endian.h
      configure:4903: result: no
      configure:4930: checking getopt.h usability
      configure:4943: gcc -c -g -O2  conftest.c >&5
      configure:4989:20: getopt.h: No such file or directory
      configure:4946: $? = 1
      configure: failed program was:
      | #line 4932 "configure"
      | /* confdefs.h.  */
      |
      | #define PACKAGE_NAME ""
      | #define PACKAGE_TARNAME ""
      | #define PACKAGE_VERSION ""
      | #define PACKAGE_STRING ""
      | #define PACKAGE_BUGREPORT ""
      | #define LIBFWBUILDER_FORMAT_VERSION "2.0.2"
      | #define STDC_HEADERS 1
      | #ifdef __cplusplus
      | #include <stdlib.h>
      | #endif
      | #define WORDS_LITTLEENDIAN 1
      | #define HAVE_STRTOK_R 1
      | #define HAVE_SYS_TYPES_H 1
      | #define HAVE_SYS_STAT_H 1
      | #define HAVE_STDLIB_H 1
      | #define HAVE_STRING_H 1
      | #define HAVE_MEMORY_H 1
      | #define HAVE_STRINGS_H 1
      | #define HAVE_INTTYPES_H 1
      | #define HAVE_UNISTD_H 1
      | /* end confdefs.h.  */
      | #include <stdio.h>
      | #if HAVE_SYS_TYPES_H
      | # include <sys/types.h>
      | #endif
      | #if HAVE_SYS_STAT_H
      | # include <sys/stat.h>
      | #endif
      | #if STDC_HEADERS
      | # include <stdlib.h>
      | # include <stddef.h>
      | #else
      | # if HAVE_STDLIB_H
      | #  include <stdlib.h>
      | # endif
      | #endif
      | #if HAVE_STRING_H
      | # if !STDC_HEADERS && HAVE_MEMORY_H
      | #  include <memory.h>
      | # endif
      | # include <string.h>
      | #endif
      | #if HAVE_STRINGS_H
      | # include <strings.h>
      | #endif
      | #if HAVE_INTTYPES_H
      | # include <inttypes.h>
      | #else
      | # if HAVE_STDINT_H
      | #  include <stdint.h>
      | # endif
      | #endif
      | #if HAVE_UNISTD_H
      | # include <unistd.h>
      | #endif
      | #include <getopt.h>
      configure:4962: result: no
      configure:4966: checking getopt.h presence
      configure:4977: gcc -E  conftest.c
      configure:4991:20: getopt.h: No such file or directory
      configure:4983: $? = 1
      configure: failed program was:
      | #line 4968 "configure"
      | /* confdefs.h.  */
      |
      | #define PACKAGE_NAME ""
      | #define PACKAGE_TARNAME ""
      | #define PACKAGE_VERSION ""
      | #define PACKAGE_STRING ""
      | #define PACKAGE_BUGREPORT ""
      | #define LIBFWBUILDER_FORMAT_VERSION "2.0.2"
      | #define STDC_HEADERS 1
      | #ifdef __cplusplus
      | #include <stdlib.h>
      | #endif
      | #define WORDS_LITTLEENDIAN 1
      | #define HAVE_STRTOK_R 1
      | #define HAVE_SYS_TYPES_H 1
      | #define HAVE_SYS_STAT_H 1
      | #define HAVE_STDLIB_H 1
      | #define HAVE_STRING_H 1
      | #define HAVE_MEMORY_H 1
      | #define HAVE_STRINGS_H 1
      | #define HAVE_INTTYPES_H 1
      | #define HAVE_UNISTD_H 1
      | /* end confdefs.h.  */
      | #include <getopt.h>
      configure:5002: result: no
      configure:5038: checking for getopt.h
      configure:5045: result: no
      configure:5059: checking whether make is GNU Make
      configure:5062: result: yes
      configure:5224: checking whether pthreads work with -pthread
      configure:5269: gcc -o conftest -I/usr/local/include -g -O2 -pthread -I/usr/local/include -g -O2  conftest.c  -L/usr/local/lib  >&5
      gcc: unrecognized option `-pthread'
      Undefined            first referenced
      symbol                  in file
      _getfp                              /var/tmp//ccyDH6WQ.o
      ld: fatal: Symbol referencing errors. No output written to conftest
      collect2: ld returned 1 exit status
      configure:5272: $? = 1
      configure: failed program was:
      | #line 5250 "configure"
      | /* confdefs.h.  */
      |
      | #define PACKAGE_NAME ""
      | #define PACKAGE_TARNAME ""
      | #define PACKAGE_VERSION ""
      | #define PACKAGE_STRING ""
      | #define PACKAGE_BUGREPORT ""
      | #define LIBFWBUILDER_FORMAT_VERSION "2.0.2"
      | #define STDC_HEADERS 1
      | #ifdef __cplusplus
      | #include <stdlib.h>
      | #endif
      | #define WORDS_LITTLEENDIAN 1
      | #define HAVE_STRTOK_R 1
      | #define HAVE_SYS_TYPES_H 1
      | #define HAVE_SYS_STAT_H 1
      | #define HAVE_STDLIB_H 1
      | #define HAVE_STRING_H 1
      | #define HAVE_MEMORY_H 1
      | #define HAVE_STRINGS_H 1
      | #define HAVE_INTTYPES_H 1
      | #define HAVE_UNISTD_H 1
      | /* end confdefs.h.  */
      | #include <pthread.h>
      | int
      | main ()
      | {
      | pthread_t th; pthread_join(th, 0);
      |                      pthread_attr_init(0); pthread_cleanup_push(0, 0);
      |                      pthread_create(0,0,0,0); pthread_cleanup_pop(0);
      |   ;
      |   return 0;
      | }
      configure:5291: result: no
      configure:5224: checking whether pthreads work with -pthreads
      configure:5269: gcc -o conftest -I/usr/local/include -g -O2 -pthreads -I/usr/local/include -g -O2  conftest.c  -L/usr/local/lib  >&5
      configure:5272: $? = 0
      configure:5275: test -s conftest
      configure:5278: $? = 0
      configure:5291: result: yes
      configure:5311: checking for joinable pthread attribute
      configure:5330: gcc -o conftest -I/usr/local/include -g -O2 -pthreads -I/usr/local/include -g -O2  conftest.c  -L/usr/local/lib  >&5
      configure:5333: $? = 0
      configure:5336: test -s conftest
      configure:5339: $? = 0
      configure:5394: result: PTHREAD_CREATE_JOINABLE
      configure:5401: checking if more special flags are required for pthreads
      configure:5408: result: -D_REENTRANT
      configure:5420: checking for cc_r
      configure:5447: result: gcc
      configure:5497: checking for xml2-config
      configure:5515: found /usr/local/bin/xml2-config
      configure:5527: result: /usr/local/bin/xml2-config
      configure:5553: checking for xmlSaveFormatFileEnc
      configure:5603: gcc -o conftest -I/usr/local/include -g -O2 -I/usr/local/include -g -O2  conftest.c -L/usr/local/lib -R/usr/local/lib -lxml2 -lz -lpthread -liconv -lm -lsocket -lnsl -L/usr/local/lib  >&5
      configure:5606: $? = 0
      configure:5609: test -s conftest
      configure:5612: $? = 0
      configure:5623: result: yes
      configure:5638: checking for xslt-config
      configure:5656: found /usr/local/bin/xslt-config
      configure:5668: result: /usr/local/bin/xslt-config
      configure:5721: checking libxslt/xsltconfig.h usability
      configure:5734: gcc -c -I/usr/local/include -g -O2 -I/usr/local/include -g -O2 conftest.c >&5
      configure:5737: $? = 0
      configure:5740: test -s conftest.o
      configure:5743: $? = 0
      configure:5753: result: yes
      configure:5757: checking libxslt/xsltconfig.h presence
      configure:5768: gcc -E -I/usr/local/include -g -O2 conftest.c
      configure:5774: $? = 0
      configure:5793: result: yes
      configure:5829: checking for libxslt/xsltconfig.h
      configure:5836: result: yes
      configure:5872: checking whether openssl is installed under /usr/local/ssl
      configure:5875: result: yes
      configure:5907: checking for SSL_library_init in -lssl
      configure:5938: gcc -o conftest -I/usr/local/include -g -O2 -I/usr/local/ssl/include -I/usr/local/include -g -O2  conftest.c -lssl -lcrypto -L/usr/local/lib  -L/usr/local/ssl/lib -R/usr/local/ssl/lib -lssl -lcrypto >&5
      configure:5941: $? = 0
      configure:5944: test -s conftest
      configure:5947: $? = 0
      configure:5959: result: yes
      configure:5970: checking for ERR_error_string_n in -lcrypto
      configure:6001: gcc -o conftest -I/usr/local/include -g -O2 -I/usr/local/ssl/include -I/usr/local/include -g -O2  conftest.c -lcrypto -lcrypto -L/usr/local/lib  -L/usr/local/ssl/lib -R/usr/local/ssl/lib -lssl -lcrypto >&5
      configure:6004: $? = 0
      configure:6007: test -s conftest
      configure:6010: $? = 0
      configure:6022: result: yes
      configure:6071: checking for MD5_Init in -lcrypto
      configure:6102: gcc -o conftest -I/usr/local/include -g -O2 -I/usr/local/include -g -O2  conftest.c -lcrypto  -L/usr/local/lib  >&5
      configure:6105: $? = 0
      configure:6108: test -s conftest
      configure:6111: $? = 0
      configure:6123: result: yes
      configure:6137: checking for net-snmp-config
      configure:6155: found /usr/local/bin/net-snmp-config
      configure:6167: result: /usr/local/bin/net-snmp-config
      configure:6177: checking for init_snmp in -lnetsnmp
      configure:6208: gcc -o conftest -I/usr/local/include -g -O2 -I/usr/local/include -g -O2  conftest.c -lnetsnmp -L/usr/local/ssl/lib -L/usr/local/lib -R/usr/local/lib -R/usr/lib -L/usr/lib -R/usr/openwin/lib -L/usr/openwin/lib -L/usr/local/ssl/lib -R/usr/local/ssl/lib -L/usr/local/lib -lnetsnmp -lgen -lcrypto -lkstat -lelf -lm -lnsl -lsocket -ladm -lcrypto -L/usr/local/lib  >&5
      configure:6211: $? = 0
      configure:6214: test -s conftest
      configure:6217: $? = 0
      configure:6229: result: yes
      configure:6245: checking for snprint_objid in -lnetsnmp
      configure:6276: gcc -o conftest -I/usr/local/include -g -O2 -I/usr/local/include -g -O2  conftest.c -lnetsnmp -L/usr/local/ssl/lib -L/usr/local/lib -R/usr/local/lib -R/usr/lib -L/usr/lib -R/usr/openwin/lib -L/usr/openwin/lib -L/usr/local/ssl/lib -R/usr/local/ssl/lib -L/usr/local/lib -lnetsnmp -lgen -lcrypto -lkstat -lelf -lm -lnsl -lsocket -ladm -lcrypto -L/usr/local/lib  >&5
      configure:6279: $? = 0
      configure:6282: test -s conftest
      configure:6285: $? = 0
      configure:6297: result: yes
      configure:6752: checking for bind/resolv.h
      configure:6771: g++ -c -g -O2 -I/usr/local/include -g -O2 conftest.cc >&5
      configure:6791:25: bind/resolv.h: No such file or directory
      configure:6774: $? = 1
      configure: failed program was:
      | #line 6757 "configure"
      | /* confdefs.h.  */
      |
      | #define PACKAGE_NAME ""
      | #define PACKAGE_TARNAME ""
      | #define PACKAGE_VERSION ""
      | #define PACKAGE_STRING ""
      | #define PACKAGE_BUGREPORT ""
      | #define LIBFWBUILDER_FORMAT_VERSION "2.0.2"
      | #define STDC_HEADERS 1
      | #ifdef __cplusplus
      | #include <stdlib.h>
      | #endif
      | #define WORDS_LITTLEENDIAN 1
      | #define HAVE_STRTOK_R 1
      | #define HAVE_SYS_TYPES_H 1
      | #define HAVE_SYS_STAT_H 1
      | #define HAVE_STDLIB_H 1
      | #define HAVE_STRING_H 1
      | #define HAVE_MEMORY_H 1
      | #define HAVE_STRINGS_H 1
      | #define HAVE_INTTYPES_H 1
      | #define HAVE_UNISTD_H 1
      | #define HAVE_XMLSAVEFORMATFILEENC 1
      | #define HAVE_LIBXSLT_XSLTCONFIG_H 1
      | #define HAVE_LIBSSL 1
      | #define HAVE_LIBCRYPTO 1
      | #define HAVE_LIBSNMP 1
      | #define NET_SNMP 1
      | #define HAVE_SNPRINT_OBJID 1
      | /* end confdefs.h.  */
      |
      | #include <netinet/in.h>
      |
      |
      | #include <bind/resolv.h>
      configure:6791: result: no
      configure:6809: checking /usr/local/bind/include/resolv.h usability
      configure:6822: g++ -c -g -O2 -I/usr/local/include -g -O2 conftest.cc >&5
      configure:6825: $? = 0
      configure:6828: test -s conftest.o
      configure:6831: $? = 0
      configure:6841: result: yes
      configure:6845: checking /usr/local/bind/include/resolv.h presence
      configure:6856: g++ -E -I/usr/local/include -g -O2 conftest.cc
      configure:6862: $? = 0
      configure:6881: result: yes
      configure:6917: checking for /usr/local/bind/include/resolv.h
      configure:6924: result: yes
      configure:7005: checking for res_nquery in -lresolv
      configure:7036: g++ -o conftest -g -O2 -I/usr/local/include -g -O2 -I/usr/local/bind/include/  conftest.cc -lresolv  -L/usr/local/ssl/lib -L/usr/local/lib -R/usr/local/lib -R/usr/lib -L/usr/lib -R/usr/openwin/lib -L/usr/openwin/lib -L/usr/local/ssl/lib -R/usr/local/ssl/lib -L/usr/local/lib -lnetsnmp -lgen -lcrypto -lkstat -lelf -lm -lnsl -lsocket -ladm -lcrypto -L/usr/local/lib  >&5
      configure:7039: $? = 0
      configure:7042: test -s conftest
      configure:7045: $? = 0
      configure:7057: result: yes
      configure:7063: checking for __res_nquery in -lresolv
      configure:7094: g++ -o conftest -g -O2 -I/usr/local/include -g -O2 -I/usr/local/bind/include/  conftest.cc -lresolv  -L/usr/local/ssl/lib -L/usr/local/lib -R/usr/local/lib -R/usr/lib -L/usr/lib -R/usr/openwin/lib -L/usr/openwin/lib -L/usr/local/ssl/lib -R/usr/local/ssl/lib -L/usr/local/lib -lnetsnmp -lgen -lcrypto -lkstat -lelf -lm -lnsl -lsocket -ladm -lcrypto -L/usr/local/lib  >&5
      Undefined            first referenced
      symbol                  in file
      __res_nquery                        /var/tmp//ccK4NJu8.o
      ld: fatal: Symbol referencing errors. No output written to conftest
      collect2: ld returned 1 exit status
      configure:7097: $? = 1
      configure: failed program was:
      | #line 7070 "configure"
      | /* confdefs.h.  */
      |
      | #define PACKAGE_NAME ""
      | #define PACKAGE_TARNAME ""
      | #define PACKAGE_VERSION ""
      | #define PACKAGE_STRING ""
      | #define PACKAGE_BUGREPORT ""
      | #define LIBFWBUILDER_FORMAT_VERSION "2.0.2"
      | #define STDC_HEADERS 1
      | #ifdef __cplusplus
      | #include <stdlib.h>
      | #endif
      | #define WORDS_LITTLEENDIAN 1
      | #define HAVE_STRTOK_R 1
      | #define HAVE_SYS_TYPES_H 1
      | #define HAVE_SYS_STAT_H 1
      | #define HAVE_STDLIB_H 1
      | #define HAVE_STRING_H 1
      | #define HAVE_MEMORY_H 1
      | #define HAVE_STRINGS_H 1
      | #define HAVE_INTTYPES_H 1
      | #define HAVE_UNISTD_H 1
      | #define HAVE_XMLSAVEFORMATFILEENC 1
      | #define HAVE_LIBXSLT_XSLTCONFIG_H 1
      | #define HAVE_LIBSSL 1
      | #define HAVE_LIBCRYPTO 1
      | #define HAVE_LIBSNMP 1
      | #define NET_SNMP 1
      | #define HAVE_SNPRINT_OBJID 1
      | /* end confdefs.h.  */
      |
      | /* Override any gcc2 internal prototype to avoid an error.  */
      | #ifdef __cplusplus
      | extern "C"
      | #endif
      | /* We use char because int might match the return type of a gcc2
      |    builtin and then its argument prototype would still apply.  */
      | char __res_nquery ();
      | int
      | main ()
      | {
      | __res_nquery ();
      |   ;
      |   return 0;
      | }
      configure:7115: result: no
      configure:7124: checking for __ns_parserr in -lresolv
      configure:7155: g++ -o conftest -g -O2 -I/usr/local/include -g -O2 -I/usr/local/bind/include/  conftest.cc -lresolv  -L/usr/local/ssl/lib -L/usr/local/lib -R/usr/local/lib -R/usr/lib -L/usr/lib -R/usr/openwin/lib -L/usr/openwin/lib -L/usr/local/ssl/lib -R/usr/local/ssl/lib -L/usr/local/lib -lnetsnmp -lgen -lcrypto -lkstat -lelf -lm -lnsl -lsocket -ladm -lcrypto -L/usr/local/lib  >&5
      configure:7158: $? = 0
      configure:7161: test -s conftest
      configure:7164: $? = 0
      configure:7176: result: yes
      configure:7264: checking for res_init in -lbind_r
      configure:7295: g++ -o conftest -g -O2 -I/usr/local/include -g -O2 -I/usr/local/bind/include/  conftest.cc -lbind_r  -L/usr/local/ssl/lib -L/usr/local/lib -R/usr/local/lib -R/usr/lib -L/usr/lib -R/usr/openwin/lib -L/usr/openwin/lib -L/usr/local/ssl/lib -R/usr/local/ssl/lib -L/usr/local/lib -lnetsnmp -lgen -lcrypto -lkstat -lelf -lm -lnsl -lsocket -ladm -lcrypto -L/usr/local/lib  >&5
      ld: fatal: library -lbind_r: not found
      ld: fatal: File processing errors. No output written to conftest
      collect2: ld returned 1 exit status
      configure:7298: $? = 1
      configure: failed program was:
      | #line 7271 "configure"
      | /* confdefs.h.  */
      |
      | #define PACKAGE_NAME ""
      | #define PACKAGE_TARNAME ""
      | #define PACKAGE_VERSION ""
      | #define PACKAGE_STRING ""
      | #define PACKAGE_BUGREPORT ""
      | #define LIBFWBUILDER_FORMAT_VERSION "2.0.2"
      | #define STDC_HEADERS 1
      | #ifdef __cplusplus
      | #include <stdlib.h>
      | #endif
      | #define WORDS_LITTLEENDIAN 1
      | #define HAVE_STRTOK_R 1
      | #define HAVE_SYS_TYPES_H 1
      | #define HAVE_SYS_STAT_H 1
      | #define HAVE_STDLIB_H 1
      | #define HAVE_STRING_H 1
      | #define HAVE_MEMORY_H 1
      | #define HAVE_STRINGS_H 1
      | #define HAVE_INTTYPES_H 1
      | #define HAVE_UNISTD_H 1
      | #define HAVE_XMLSAVEFORMATFILEENC 1
      | #define HAVE_LIBXSLT_XSLTCONFIG_H 1
      | #define HAVE_LIBSSL 1
      | #define HAVE_LIBCRYPTO 1
      | #define HAVE_LIBSNMP 1
      | #define NET_SNMP 1
      | #define HAVE_SNPRINT_OBJID 1
      | #define HAVE_GOODLIBRESOLV 1
      | /* end confdefs.h.  */
      |
      | /* Override any gcc2 internal prototype to avoid an error.  */
      | #ifdef __cplusplus
      | extern "C"
      | #endif
      | /* We use char because int might match the return type of a gcc2
      |    builtin and then its argument prototype would still apply.  */
      | char res_init ();
      | int
      | main ()
      | {
      | res_init ();
      |   ;
      |   return 0;
      | }
      configure:7316: result: no
      configure:7631: checking for rpc_call in -lnsl
      configure:7662: g++ -o conftest -g -O2 -I/usr/local/include -g -O2 -I/usr/local/bind/include/  conftest.cc -lnsl  -L/usr/local/ssl/lib -L/usr/local/lib -R/usr/local/lib -R/usr/lib -L/usr/lib -R/usr/openwin/lib -L/usr/openwin/lib -L/usr/local/ssl/lib -R/usr/local/ssl/lib -L/usr/local/lib -lnetsnmp -lgen -lcrypto -lkstat -lelf -lm -lnsl -lsocket -ladm -lcrypto -L/usr/local/lib  >&5
      configure:7665: $? = 0
      configure:7668: test -s conftest
      configure:7671: $? = 0
      configure:7683: result: yes
      configure:7697: checking if gethostbyname_r is declared
      configure:7723: g++ -c -g -O2 -I/usr/local/include -g -O2 -I/usr/local/bind/include/ conftest.cc >&5
      configure:7726: $? = 0
      configure:7729: test -s conftest.o
      configure:7732: $? = 0
      configure:7735: result: yes
      configure:7813: checking for gethostbyname_r
      configure:7863: g++ -o conftest -g -O2 -I/usr/local/include -g -O2 -I/usr/local/bind/include/  conftest.cc -lnsl -L/usr/local/ssl/lib -L/usr/local/lib -R/usr/local/lib -R/usr/lib -L/usr/lib -R/usr/openwin/lib -L/usr/openwin/lib -L/usr/local/ssl/lib -R/usr/local/ssl/lib -L/usr/local/lib -lnetsnmp -lgen -lcrypto -lkstat -lelf -lm -lnsl -lsocket -ladm -lcrypto -L/usr/local/lib  >&5
      configure:7866: $? = 0
      configure:7869: test -s conftest
      configure:7872: $? = 0
      configure:7883: result: yes
      configure:7902: checking if gethostbyname_r takes 3 arguments
      configure:7931: g++ -c -g -O2 -I/usr/local/include -g -O2 -I/usr/local/bind/include/ conftest.cc >&5
      configure: In function `int main()':
      configure:7948: error: aggregate `hostent_data data' has incomplete type and cannot be defined
      configure:7934: $? = 1
      configure: failed program was:
      | #line 7904 "configure"
      | /* confdefs.h.  */
      |
      | #define PACKAGE_NAME ""
      | #define PACKAGE_TARNAME ""
      | #define PACKAGE_VERSION ""
      | #define PACKAGE_STRING ""
      | #define PACKAGE_BUGREPORT ""
      | #define LIBFWBUILDER_FORMAT_VERSION "2.0.2"
      | #define STDC_HEADERS 1
      | #ifdef __cplusplus
      | #include <stdlib.h>
      | #endif
      | #define WORDS_LITTLEENDIAN 1
      | #define HAVE_STRTOK_R 1
      | #define HAVE_SYS_TYPES_H 1
      | #define HAVE_SYS_STAT_H 1
      | #define HAVE_STDLIB_H 1
      | #define HAVE_STRING_H 1
      | #define HAVE_MEMORY_H 1
      | #define HAVE_STRINGS_H 1
      | #define HAVE_INTTYPES_H 1
      | #define HAVE_UNISTD_H 1
      | #define HAVE_XMLSAVEFORMATFILEENC 1
      | #define HAVE_LIBXSLT_XSLTCONFIG_H 1
      | #define HAVE_LIBSSL 1
      | #define HAVE_LIBCRYPTO 1
      | #define HAVE_LIBSNMP 1
      | #define NET_SNMP 1
      | #define HAVE_SNPRINT_OBJID 1
      | #define HAVE_GOODLIBRESOLV 1
      | #define HAVE_LIBNSL 1
      | #define HAVE_GETHOSTBYNAME_R 1
      | /* end confdefs.h.  */
      |
      | #define __FWB_DUMMY__
      | #include <netdb.h>
      |
      | int
      | main ()
      | {
      |
      |
      |         char *name;
      |         struct hostent *he;
      |         struct hostent_data data;
      |         (void) gethostbyname_r(name, he, &data);
      |
      |
      |   ;
      |   return 0;
      | }
      configure:7954: result: no
      configure:7956: checking if gethostbyname_r takes 6 arguments
      configure:7985: g++ -c -g -O2 -I/usr/local/include -g -O2 -I/usr/local/bind/include/ conftest.cc >&5
      configure: In function `int main()':
      configure:8004: error: cannot convert `hostent**' to `int*' for argument `5' to `hostent* gethostbyname_r(const char*, hostent*, char*, int, int*)'
      configure:7988: $? = 1
      configure: failed program was:
      | #line 7958 "configure"
      | /* confdefs.h.  */
      |
      | #define PACKAGE_NAME ""
      | #define PACKAGE_TARNAME ""
      | #define PACKAGE_VERSION ""
      | #define PACKAGE_STRING ""
      | #define PACKAGE_BUGREPORT ""
      | #define LIBFWBUILDER_FORMAT_VERSION "2.0.2"
      | #define STDC_HEADERS 1
      | #ifdef __cplusplus
      | #include <stdlib.h>
      | #endif
      | #define WORDS_LITTLEENDIAN 1
      | #define HAVE_STRTOK_R 1
      | #define HAVE_SYS_TYPES_H 1
      | #define HAVE_SYS_STAT_H 1
      | #define HAVE_STDLIB_H 1
      | #define HAVE_STRING_H 1
      | #define HAVE_MEMORY_H 1
      | #define HAVE_STRINGS_H 1
      | #define HAVE_INTTYPES_H 1
      | #define HAVE_UNISTD_H 1
      | #define HAVE_XMLSAVEFORMATFILEENC 1
      | #define HAVE_LIBXSLT_XSLTCONFIG_H 1
      | #define HAVE_LIBSSL 1
      | #define HAVE_LIBCRYPTO 1
      | #define HAVE_LIBSNMP 1
      | #define NET_SNMP 1
      | #define HAVE_SNPRINT_OBJID 1
      | #define HAVE_GOODLIBRESOLV 1
      | #define HAVE_LIBNSL 1
      | #define HAVE_GETHOSTBYNAME_R 1
      | /* end confdefs.h.  */
      |
      | #define __FWB_DUMMY__
      | #include <netdb.h>
      |
      | int
      | main ()
      | {
      |
      |     char *name;
      |     struct hostent *he, *res;
      |     char buffer[2048];
      |     int buflen = 2048;
      |     int h_errnop;
      |     (void) gethostbyname_r(name, he, buffer, buflen, &res, &h_errnop)
      |
      |   ;
      |   return 0;
      | }
      configure:8008: result: no
      configure:8010: checking if gethostbyname_r takes 5 arguments
      configure:8039: g++ -c -g -O2 -I/usr/local/include -g -O2 -I/usr/local/bind/include/ conftest.cc >&5
      configure:8042: $? = 0
      configure:8045: test -s conftest.o
      configure:8048: $? = 0
      configure:8050: result: yes
      configure:8081: checking if gethostbyaddr_r is declared
      configure:8107: g++ -c -g -O2 -I/usr/local/include -g -O2 -I/usr/local/bind/include/ conftest.cc >&5
      configure:8110: $? = 0
      configure:8113: test -s conftest.o
      configure:8116: $? = 0
      configure:8119: result: yes
      configure:8196: checking for gethostbyaddr_r
      configure:8246: g++ -o conftest -g -O2 -I/usr/local/include -g -O2 -I/usr/local/bind/include/  conftest.cc -lnsl -L/usr/local/ssl/lib -L/usr/local/lib -R/usr/local/lib -R/usr/lib -L/usr/lib -R/usr/openwin/lib -L/usr/openwin/lib -L/usr/local/ssl/lib -R/usr/local/ssl/lib -L/usr/local/lib -lnetsnmp -lgen -lcrypto -lkstat -lelf -lm -lnsl -lsocket -ladm -lcrypto -L/usr/local/lib  >&5
      configure:8249: $? = 0
      configure:8252: test -s conftest
      configure:8255: $? = 0
      configure:8266: result: yes
      configure:8286: checking if gethostbyaddr_r takes 5 arguments
      configure:8317: g++ -c -g -O2 -I/usr/local/include -g -O2 -I/usr/local/bind/include/ conftest.cc >&5
      configure: In function `int main()':
      configure:8336: error: aggregate `hostent_data hdata' has incomplete type and cannot be defined
      configure:8320: $? = 1
      configure: failed program was:
      | #line 8288 "configure"
      | /* confdefs.h.  */
      |
      | #define PACKAGE_NAME ""
      | #define PACKAGE_TARNAME ""
      | #define PACKAGE_VERSION ""
      | #define PACKAGE_STRING ""
      | #define PACKAGE_BUGREPORT ""
      | #define LIBFWBUILDER_FORMAT_VERSION "2.0.2"
      | #define STDC_HEADERS 1
      | #ifdef __cplusplus
      | #include <stdlib.h>
      | #endif
      | #define WORDS_LITTLEENDIAN 1
      | #define HAVE_STRTOK_R 1
      | #define HAVE_SYS_TYPES_H 1
      | #define HAVE_SYS_STAT_H 1
      | #define HAVE_STDLIB_H 1
      | #define HAVE_STRING_H 1
      | #define HAVE_MEMORY_H 1
      | #define HAVE_STRINGS_H 1
      | #define HAVE_INTTYPES_H 1
      | #define HAVE_UNISTD_H 1
      | #define HAVE_XMLSAVEFORMATFILEENC 1
      | #define HAVE_LIBXSLT_XSLTCONFIG_H 1
      | #define HAVE_LIBSSL 1
      | #define HAVE_LIBCRYPTO 1
      | #define HAVE_LIBSNMP 1
      | #define NET_SNMP 1
      | #define HAVE_SNPRINT_OBJID 1
      | #define HAVE_GOODLIBRESOLV 1
      | #define HAVE_LIBNSL 1
      | #define HAVE_GETHOSTBYNAME_R 1
      | #define HAVE_FUNC_GETHOSTBYNAME_R_5 1
      | #define HAVE_GETHOSTBYADDR_R 1
      | /* end confdefs.h.  */
      |
      | #define __FWB_DUMMY__
      | #include <sys/types.h>
      | #include <netdb.h>
      |
      | int
      | main ()
      | {
      |
      | char * address;
      | int length;
      | int type;
      | struct hostent h;
      | struct hostent_data hdata;
      | int rc;
      | rc = gethostbyaddr_r(address, length, type, &h, &hdata);
      |
      |   ;
      |   return 0;
      | }
      configure:8344: result: no
      configure:8346: checking if gethostbyaddr_r takes 7 arguments
      configure:8380: g++ -c -g -O2 -I/usr/local/include -g -O2 -I/usr/local/bind/include/ conftest.cc >&5
      configure:8383: $? = 0
      configure:8386: test -s conftest.o
      configure:8389: $? = 0
      configure:8392: result: yes
      configure:8627: checking for md5
      configure:8660: result: no
      configure:8667: checking for md5sum
      configure:8700: result: no
      configure:8712: checking for doc++
      configure:8741: result: no
      configure:8760: checking where to install documentation
      configure:8767: result: /usr/local/share/doc/libfwbuilder-2.0.2
      configure:8778: checking for ccache
      configure:8811: result: no
      configure:8936: creating ./config.status

      ## ---------------------- ##
      ## Running config.status. ##
      ## ---------------------- ##

      This file was extended by config.status, which was
      generated by GNU Autoconf 2.57.  Invocation command line was

        CONFIG_FILES    =
        CONFIG_HEADERS  =
        CONFIG_LINKS    =
        CONFIG_COMMANDS =
        $ ./config.status

      on solaris

      config.status:678: creating qmake.inc
      config.status:678: creating src/confscript/libfwbuilder-config-2
      config.status:678: creating etc/fwbuilder.dtd
      config.status:782: creating src/fwbuilder/libfwbuilder-config.h
      config.status:919: src/fwbuilder/libfwbuilder-config.h is unchanged

      ## ---------------- ##
      ## Cache variables. ##
      ## ---------------- ##

      ac_cv_build=i386-pc-solaris2.9
      ac_cv_build_alias=i386-pc-solaris2.9
      ac_cv_c_bigendian=no
      ac_cv_c_compiler_gnu=yes
      ac_cv_cxx_compiler_gnu=yes
      ac_cv_env_CC_set=
      ac_cv_env_CC_value=
      ac_cv_env_CFLAGS_set=
      ac_cv_env_CFLAGS_value=
      ac_cv_env_CPPFLAGS_set=
      ac_cv_env_CPPFLAGS_value=
      ac_cv_env_CPP_set=
      ac_cv_env_CPP_value=
      ac_cv_env_CXXCPP_set=
      ac_cv_env_CXXCPP_value=
      ac_cv_env_CXXFLAGS_set=
      ac_cv_env_CXXFLAGS_value=
      ac_cv_env_CXX_set=
      ac_cv_env_CXX_value=
      ac_cv_env_LDFLAGS_set=
      ac_cv_env_LDFLAGS_value=
      ac_cv_env_build_alias_set=
      ac_cv_env_build_alias_value=
      ac_cv_env_host_alias_set=
      ac_cv_env_host_alias_value=
      ac_cv_env_target_alias_set=
      ac_cv_env_target_alias_value=
      ac_cv_exeext=
      ac_cv_func_gethostbyaddr_r=yes
      ac_cv_func_gethostbyname_r=yes
      ac_cv_func_strtok_r=yes
      ac_cv_func_which_gethostname_r=5
      ac_cv_func_xmlSaveFormatFileEnc=yes
      ac_cv_gethostbyaddr_args=7
      ac_cv_header__usr_local_bind_include_resolv_h=yes
      ac_cv_header_bind_resolv_h=no
      ac_cv_header_endian_h=no
      ac_cv_header_getopt_h=no
      ac_cv_header_inttypes_h=yes
      ac_cv_header_libxslt_xsltconfig_h=yes
      ac_cv_header_memory_h=yes
      ac_cv_header_stdc=yes
      ac_cv_header_stdint_h=no
      ac_cv_header_stdlib_h=yes
      ac_cv_header_string_h=yes
      ac_cv_header_strings_h=yes
      ac_cv_header_sys_stat_h=yes
      ac_cv_header_sys_types_h=yes
      ac_cv_header_unistd_h=yes
      ac_cv_host=i386-pc-solaris2.9
      ac_cv_host_alias=i386-pc-solaris2.9
      ac_cv_lib_bind_r_res_init=no
      ac_cv_lib_cposix_strerror=no
      ac_cv_lib_crypto_ERR_error_string_n=yes
      ac_cv_lib_crypto_MD5_Init=yes
      ac_cv_lib_netsnmp_init_snmp=yes
      ac_cv_lib_netsnmp_snprint_objid=yes
      ac_cv_lib_nsl_rpc_call=yes
      ac_cv_lib_resolv___ns_parserr=yes
      ac_cv_lib_resolv___res_nquery=no
      ac_cv_lib_resolv_res_nquery=yes
      ac_cv_lib_ssl_SSL_library_init=yes
      ac_cv_objext=o
      ac_cv_path_NET_SNMP_CONFIG=/usr/local/bin/net-snmp-config
      ac_cv_path_QMAKE=/usr/local/qt/bin/qmake
      ac_cv_path_XML2_CONFIG=/usr/local/bin/xml2-config
      ac_cv_path_XSLT_CONFIG=/usr/local/bin/xslt-config
      ac_cv_prog_CPP=$'gcc -E'
      ac_cv_prog_CXXCPP=$'g++ -E'
      ac_cv_prog_PTHREAD_CC=gcc
      ac_cv_prog_ac_ct_CC=gcc
      ac_cv_prog_ac_ct_CXX=g++
      ac_cv_prog_cc_g=yes
      ac_cv_prog_cc_stdc=
      ac_cv_prog_cxx_g=yes
      ac_cv_prog_egrep=egrep
      ac_cv_prog_make_make_set=yes
      ac_cv_target=i386-pc-solaris2.9
      ac_cv_target_alias=i386-pc-solaris2.9

      ## ----------------- ##
      ## Output variables. ##
      ## ----------------- ##

      CC='gcc'
      CCACHE=''
      CFLAGS='-I/usr/local/include -g -O2'
      CPP='gcc -E'
      CPPFLAGS='-I/usr/local/include -g -O2 -I/usr/local/bind/include/'
      CXX='g++'
      CXXCPP='g++ -E'
      CXXFLAGS='-g -O2'
      DEFS='-DHAVE_CONFIG_H'
      DOCDIR='/usr/local/share/doc/libfwbuilder-2.0.2'
      DOCPP=''
      ECHO_C=''
      ECHO_N='-n'
      ECHO_T=''
      EGREP='egrep'
      EXEC_PREFIX='$$prefix'
      EXEEXT=''
      HAVE_LIBSSL='yes'
      INSTALL_DATA='${INSTALL} -m 644'
      INSTALL_PROGRAM='${INSTALL}'
      INSTALL_SCRIPT='${INSTALL}'
      ISC_CONFIG=''
      IS_WIN32_PLATFORM='no'
      LDFLAGS=''
      LIBDIR='$$exec_prefix/lib'
      LIBFWBUILDER_LIBDIR='-L${libdir} -R${exec_prefix}/lib'
      LIBFWBUILDER_LIB_VER='2.0'
      LIBFWBUILDER_SOLIB_VERSION='6.1.0'
      LIBFWBUILDER_SO_VERSION='6:1:0'
      LIBFWBUILDER_VERSION='2.0.2'
      LIBMAJOR='6'
      LIBOBJS=''
      LIBS='-lnsl -L/usr/local/ssl/lib -L/usr/local/lib -R/usr/local/lib -R/usr/lib -L/usr/lib -R/usr/openwin/lib -L/usr/openwin/lib -L/usr/local/ssl/lib -R/usr/local/ssl/lib -L/usr/local/lib -lnetsnmp -lgen -lcrypto -lkstat -lelf -lm -lnsl -lsocket -ladm -lcrypto -L/usr/local/lib '
      LIBSNMP_LIBS='-L/usr/local/ssl/lib -L/usr/local/lib -R/usr/local/lib -R/usr/lib -L/usr/lib -R/usr/openwin/lib -L/usr/openwin/lib -L/usr/local/ssl/lib -R/usr/local/ssl/lib -L/usr/local/lib -lnetsnmp -lgen -lcrypto -lkstat -lelf -lm -lnsl -lsocket -ladm'
      LIBS_Q='-lnsl -L/usr/local/ssl/lib -L/usr/local/lib -R/usr/local/lib -R/usr/lib -L/usr/lib -R/usr/openwin/lib -L/usr/openwin/lib -L/usr/local/ssl/lib -R/usr/local/ssl/lib -L/usr/local/lib -lnetsnmp -lgen -lcrypto -lkstat -lelf -lm -lnsl -lsocket -ladm -lcrypto -L/usr/local/lib'
      LIB_RESOLV='-lresolv'
      LTLIBOBJS=''
      LWRES_CFLAGS=''
      LWRES_CFLAGS_Q=''
      LWRES_LIBS=''
      MD5=''
      NET_SNMP_CONFIG='/usr/local/bin/net-snmp-config'
      OBJEXT='o'
      OPENSSL_CFLAGS='-I/usr/local/ssl/include'
      OPENSSL_CFLAGS_Q='/usr/local/ssl/include'
      OPENSSL_LIBS='-L/usr/local/ssl/lib -R/usr/local/ssl/lib -lssl -lcrypto'
      PACKAGE_BUGREPORT=''
      PACKAGE_NAME=''
      PACKAGE_STRING=''
      PACKAGE_TARNAME=''
      PACKAGE_VERSION=''
      PATH_SEPARATOR=':'
      PTHREAD_CC='gcc'
      PTHREAD_CFLAGS='-D_REENTRANT -pthreads'
      PTHREAD_CFLAGS_Q='-D_REENTRANT -pthreads'
      PTHREAD_LIBS=''
      QMAKE='/usr/local/qt/bin/qmake'
      RELEASE_NUM='1'
      RPMRELEASE='1'
      SET_MAKE=''
      SHELL='/bin/bash'
      STL_CFLAGS=''
      STL_LDFLAGS=''
      STL_LIBS=''
      TEMPLATE_DIR='/usr/local/share/libfwbuilder'
      XML2_CONFIG='/usr/local/bin/xml2-config'
      XML_CFLAGS='-I/usr/local/include/libxml2'
      XML_CFLAGS_Q='/usr/local/include/libxml2'
      XML_LIBS='-L/usr/local/lib -R/usr/local/lib -lxml2 -lz -lpthread -liconv -lm -lsocket -lnsl'
      XSLT_CFLAGS=' -I/usr/local/include'
      XSLT_CFLAGS_Q='/usr/local/include'
      XSLT_CONFIG='/usr/local/bin/xslt-config'
      XSLT_LIBS=' -lxslt'
      ac_ct_CC='gcc'
      ac_ct_CXX='g++'
      bindir='${exec_prefix}/bin'
      build='i386-pc-solaris2.9'
      build_alias=''
      build_cpu='i386'
      build_os='solaris2.9'
      build_vendor='pc'
      datadir='${prefix}/share'
      exec_prefix='${prefix}'
      host='i386-pc-solaris2.9'
      host_alias=''
      host_cpu='i386'
      host_os='solaris2.9'
      host_vendor='pc'
      includedir='${prefix}/include'
      infodir='${prefix}/info'
      libdir='${exec_prefix}/lib'
      libexecdir='${exec_prefix}/libexec'
      localstatedir='${prefix}/var'
      mandir='${prefix}/man'
      oldincludedir='/usr/include'
      prefix='/usr/local'
      program_transform_name='s,x,x,'
      sbindir='${exec_prefix}/sbin'
      sharedstatedir='${prefix}/com'
      sysconfdir='${prefix}/etc'
      target='i386-pc-solaris2.9'
      target_alias=''
      target_cpu='i386'
      target_os='solaris2.9'
      target_vendor='pc'

      ## ----------- ##
      ## confdefs.h. ##
      ## ----------- ##

      #define DOCDIR "/usr/local/share/doc/libfwbuilder-2.0.2"
      #define HAVE_FUNC_GETHOSTBYNAME_R_5 1
      #define HAVE_GETHOSTBYADDR_R 1
      #define HAVE_GETHOSTBYADDR_R_7 1
      #define HAVE_GETHOSTBYNAME_R 1
      #define HAVE_GOODLIBRESOLV 1
      #define HAVE_INTTYPES_H 1
      #define HAVE_LIBCRYPTO 1
      #define HAVE_LIBNSL 1
      #define HAVE_LIBSNMP 1
      #define HAVE_LIBSSL 1
      #define HAVE_LIBXSLT_XSLTCONFIG_H 1
      #define HAVE_MEMORY_H 1
      #define HAVE_SNPRINT_OBJID 1
      #define HAVE_STDLIB_H 1
      #define HAVE_STRINGS_H 1
      #define HAVE_STRING_H 1
      #define HAVE_STRTOK_R 1
      #define HAVE_SYS_STAT_H 1
      #define HAVE_SYS_TYPES_H 1
      #define HAVE_UNISTD_H 1
      #define HAVE_XMLSAVEFORMATFILEENC 1
      #define LIBFWBUILDER_FORMAT_VERSION "2.0.2"
      #define LIBFWBUILDER_TEMPLATE_DIR "/usr/local/share/libfwbuilder"
      #define NET_SNMP 1
      #define PACKAGE_BUGREPORT ""
      #define PACKAGE_NAME ""
      #define PACKAGE_STRING ""
      #define PACKAGE_TARNAME ""
      #define PACKAGE_VERSION ""
      #define STDC_HEADERS 1
      #define VERSION "2.0.2"
      #define WORDS_LITTLEENDIAN 1
      #endif
      #ifdef __cplusplus
      #include <stdlib.h>

      configure: exit 0

      Any advise on this issue is greatly appreciated.
      Thanks

      ld