#209 Fuppes fails to build

open
nobody
None
5
2012-01-13
2012-01-13
Anonymous
No

Fuppes fails to build on Arch linux x86_64 using PKGBUILD found in the wiki

Steps to Reproduce: Follow instructions on the wiki for compiling on Arch linux. First change SVN trunk to current (https://fuppes.svn.sourceforge.net/svnroot/fuppes/trunk) and change "pkgver" to "691". Begin the makepkg procedure and the installer will abort.

make install-data-hook
make[3]: Entering directory `/home/redemblem/src/fuppes-makepkg/src/fuppes-build/config'
test -f /usr/var/lib/fuppes/fuppes.cfg || cp /usr/var/lib/fuppes/fuppes.cfg.default /usr/var/lib/fuppes/fuppes.cfg
cp: cannot stat `/usr/var/lib/fuppes/fuppes.cfg.default': No such file or directory
make[3]: *** [install-data-hook] Error 1
make[3]: Leaving directory `/home/redemblem/src/fuppes-makepkg/src/fuppes-build/config'
make[2]: *** [install-data-am] Error 2
make[2]: Leaving directory `/home/redemblem/src/fuppes-makepkg/src/fuppes-build/config'
make[1]: *** [install-am] Error 2
make[1]: Leaving directory `/home/redemblem/src/fuppes-makepkg/src/fuppes-build/config'
make: *** [install-recursive] Error 1
==> ERROR: A failure occurred in build().
Aborting...

Discussion