#7 Found bug in nedit fink install script

closed-fixed
None
5
2001-05-27
2001-04-09
Anonymous
No

I tried to install nedit but found that when it tried to
download Lesstiff the file was not found.

The file on the Lesstiff site is

lesstif-0.92.26.tar.gz

at present th install script uses

lesstif-0.92.6.tar.gz

I edited the lesstiff file in fink.info and then
renamed the patch file .... - ah well - nice try - the
compile failed - here's the last part of the
compile....

In file included from mwm.c:60:
/usr/include/sys/resource.h:79: field `ru_utime' has
incomplete type
/usr/include/sys/resource.h:80: field `ru_stime' has
incomplete type
make[3]: *** [mwm.o] Error 1
make[2]: *** [all-recursive] Error 1
make[1]: *** [all-recursive] Error 1
make: *** [all-recursive] Error 1
### make failed, exit code 2
Failed: compiling failed

Would appreciate a fix for this.

Cheers - dhi

Discussion

  • Logged In: YES
    user_id=51640

    In CVS the lesstif package has been fixed to point at the
    lesstif-0.92.6.tar.gz file in the obsolete directory on the
    server. A package that uses the new upstream version will
    be done later.

     
    • assigned_to: nobody --> chrisp
    • status: open --> open-later
     
  • Logged In: YES
    user_id=51640

    A package for lesstif 0.92.26 is now in CVS. Closing the
    bug.

     
    • status: open-later --> closed-fixed