#20 gnome-libs-1.2.12-2 install fails

closed-wont-fix
nobody
None
5
2001-07-28
2001-06-21
Anonymous
No

gnome-libs-1.2.12-2 install fails midway. moving up to gnome-libs-1.2.13 seems to remedy the problem. found en route to installing gimp. thx

Discussion

  • Logged In: YES
    user_id=51640

    Would you care to give more details? Like, where in the
    build process does it fail, what the error messages are,
    etc.?

     
  • Logged In: NO

    rm -f .libs/gnome-magic.lo
    cc -DHAVE_CONFIG_H -I. -I. -I.. -I.. -I./.. -
    DNEED_GNOMESUPPORT_H -I../support -I../support -
    I../intl -I../intl -I/sw/include -I/sw/lib/glib/include -I/usr/
    X11R6/include -I/sw/include/gtk-1.2 -I/sw/include/glib-
    1.2 -I/sw/lib/glib/include -I/usr/X11R6/include -I/sw/
    include -I/usr/X11R6/include -I/sw/include -I/sw/include
    -DGNOMELIBDIR=\"/sw/lib\" -DGNOMEDATADIR=\"/sw/
    share\" -DGNOMEBINDIR=\"/sw/bin\" -
    DGNOMELOCALSTATEDIR=\"/sw/var\" -
    DGNOMELOCALEDIR=\"/sw/lib/locale\" -
    DGNOMESYSCONFDIR=\"/sw/etc\" -DVERSION=\ "1.2.12\" -DG_LOG_DOMAIN=\"Gnome\" -traditional-cpp
    -I/sw/include -I/sw/include/gtk-1.2 -I/sw/include/glib-1.2
    -I/sw/lib/glib/include -I/usr/X11R6/include -g -O2 -Wall -
    Wunused -c gnome-magic.c -fno-common -DPIC -o
    .libs/gnome-magic.lo
    cc -DHAVE_CONFIG_H -I. -I. -I.. -I.. -I./.. -
    DNEED_GNOMESUPPORT_H -I../support -I../support -
    I../intl -I../intl -I/sw/include -I/sw/lib/glib/include -I/usr/
    X11R6/include -I/sw/include/gtk-1.2 -I/sw/include/glib-
    1.2 -I/sw/lib/glib/include -I/usr/X11R6/include -I/sw/
    include -I/usr/X11R6/include -I/sw/include -I/sw/include
    -DGNOMELIBDIR=\"/sw/lib\" -DGNOMEDATADIR=\"/sw/
    share\" -DGNOMEBINDIR=\"/sw/bin\" -
    DGNOMELOCALSTATEDIR=\"/sw/var\" -
    DGNOMELOCALEDIR=\"/sw/lib/locale\" -
    DGNOMESYSCONFDIR=\"/sw/etc\" -DVERSION=\ "1.2.12\" -DG_LOG_DOMAIN=\"Gnome\" -traditional-cpp
    -I/sw/include -I/sw/include/gtk-1.2 -I/sw/include/glib-1.2
    -I/sw/lib/glib/include -I/usr/X11R6/include -g -O2 -Wall -
    Wunused -c gnome-magic.c -o gnome-magic.o >/dev/
    null 2>&1
    mv -f .libs/gnome-magic.lo gnome-magic.lo
    /bin/sh ../libtool --mode=compile cc -
    DHAVE_CONFIG_H -I. -I. -I.. -I.. -I./.. -
    DNEED_GNOMESUPPORT_H -I../support -I../support
    -I../intl -I../intl -I/sw/include -I/sw/lib/glib/include -I/usr/
    X11R6/include -I/sw/include/gtk-1.2 -I/sw/include/glib-
    1.2 -I/sw/lib/glib/include -I/usr/X11R6/include -I/sw/
    include -I/usr/X11R6/include -I/sw/include -I/sw/
    include -DGNOMELIBDIR=\""/sw/lib"\" -
    DGNOMEDATADIR=\""/sw/share"\" -DGNOMEBINDIR=
    \""/sw/bin"\" -DGNOMELOCALSTATEDIR=\""/sw/var"\"
    -DGNOMELOCALEDIR=\""/sw/lib/locale"\" -
    DGNOMESYSCONFDIR=\""/sw/etc"\" -DVERSION=\ ""1.2.12"\" -DG_LOG_DOMAIN=\"Gnome\" -traditional-
    cpp -I/sw/include -I/sw/include/gtk-1.2 -I/sw/include/
    glib-1.2 -I/sw/lib/glib/include -I/usr/X11R6/include -g -
    O2 -Wall -Wunused -c gnome-metadata.c
    rm -f .libs/gnome-metadata.lo
    cc -DHAVE_CONFIG_H -I. -I. -I.. -I.. -I./.. -
    DNEED_GNOMESUPPORT_H -I../support -I../support -
    I../intl -I../intl -I/sw/include -I/sw/lib/glib/include -I/usr/
    X11R6/include -I/sw/include/gtk-1.2 -I/sw/include/glib-
    1.2 -I/sw/lib/glib/include -I/usr/X11R6/include -I/sw/
    include -I/usr/X11R6/include -I/sw/include -I/sw/include
    -DGNOMELIBDIR=\"/sw/lib\" -DGNOMEDATADIR=\"/sw/
    share\" -DGNOMEBINDIR=\"/sw/bin\" -
    DGNOMELOCALSTATEDIR=\"/sw/var\" -
    DGNOMELOCALEDIR=\"/sw/lib/locale\" -
    DGNOMESYSCONFDIR=\"/sw/etc\" -DVERSION=\ "1.2.12\" -DG_LOG_DOMAIN=\"Gnome\" -traditional-cpp
    -I/sw/include -I/sw/include/gtk-1.2 -I/sw/include/glib-1.2
    -I/sw/lib/glib/include -I/usr/X11R6/include -g -O2 -Wall -
    Wunused -c gnome-metadata.c -fno-common -DPIC -
    o .libs/gnome-metadata.lo
    gnome-metadata.c: In function `init':
    gnome-metadata.c:176: warning: implicit declaration of
    function `dbopen'
    gnome-metadata.c:177: warning: assignment makes
    pointer from integer without a cast
    gnome-metadata.c: In function `metadata_set':
    gnome-metadata.c:302: warning: passing arg 2 of
    pointer to function from incompatible pointer type
    gnome-metadata.c:302: too few arguments to function
    gnome-metadata.c:329: warning: passing arg 2 of
    pointer to function from incompatible pointer type
    gnome-metadata.c:329: too few arguments to function
    gnome-metadata.c:350: warning: passing arg 2 of
    pointer to function from incompatible pointer type
    gnome-metadata.c:350: too few arguments to function
    gnome-metadata.c:357: warning: passing arg 2 of
    pointer to function from incompatible pointer type
    gnome-metadata.c:357: too few arguments to function
    gnome-metadata.c: In function `metadata_remove':
    gnome-metadata.c:389: warning: passing arg 2 of
    pointer to function from incompatible pointer type
    gnome-metadata.c:389: too few arguments to function
    gnome-metadata.c:416: warning: passing arg 2 of
    pointer to function from incompatible pointer type
    gnome-metadata.c:416: too few arguments to function
    gnome-metadata.c:433: warning: passing arg 2 of
    pointer to function from incompatible pointer type
    gnome-metadata.c:433: too few arguments to function
    gnome-metadata.c:450: warning: passing arg 2 of
    pointer to function from incompatible pointer type
    gnome-metadata.c:450: too few arguments to function
    gnome-metadata.c: In function `metadata_get_list':
    gnome-metadata.c:482: warning: passing arg 2 of
    pointer to function from incompatible pointer type
    gnome-metadata.c:482: too few arguments to function
    gnome-metadata.c: In function
    `metadata_get_no_dup':
    gnome-metadata.c:515: warning: passing arg 2 of
    pointer to function from incompatible pointer type
    gnome-metadata.c:515: too few arguments to function
    gnome-metadata.c: In function `maybe_scan_app_dir':
    gnome-metadata.c:784: warning: passing arg 3 of
    `scandir' from incompatible pointer type
    make[2]: *** [gnome-metadata.lo] Error 1
    make[1]: *** [all-recursive] Error 1
    make: *** [all-recursive-am] Error 2
    ### make failed, exit code 2
    Failed: compiling gnome-libs-1.2.12-2 failed

     
  • Logged In: NO

    rm -f .libs/gnome-magic.lo
    cc -DHAVE_CONFIG_H -I. -I. -I.. -I.. -I./.. -
    DNEED_GNOMESUPPORT_H -I../support -I../support -
    I../intl -I../intl -I/sw/include -I/sw/lib/glib/include -I/usr/
    X11R6/include -I/sw/include/gtk-1.2 -I/sw/include/glib-
    1.2 -I/sw/lib/glib/include -I/usr/X11R6/include -I/sw/
    include -I/usr/X11R6/include -I/sw/include -I/sw/include
    -DGNOMELIBDIR=\"/sw/lib\" -DGNOMEDATADIR=\"/sw/
    share\" -DGNOMEBINDIR=\"/sw/bin\" -
    DGNOMELOCALSTATEDIR=\"/sw/var\" -
    DGNOMELOCALEDIR=\"/sw/lib/locale\" -
    DGNOMESYSCONFDIR=\"/sw/etc\" -DVERSION=\ "1.2.12\" -DG_LOG_DOMAIN=\"Gnome\" -traditional-cpp
    -I/sw/include -I/sw/include/gtk-1.2 -I/sw/include/glib-1.2
    -I/sw/lib/glib/include -I/usr/X11R6/include -g -O2 -Wall -
    Wunused -c gnome-magic.c -fno-common -DPIC -o
    .libs/gnome-magic.lo
    cc -DHAVE_CONFIG_H -I. -I. -I.. -I.. -I./.. -
    DNEED_GNOMESUPPORT_H -I../support -I../support -
    I../intl -I../intl -I/sw/include -I/sw/lib/glib/include -I/usr/
    X11R6/include -I/sw/include/gtk-1.2 -I/sw/include/glib-
    1.2 -I/sw/lib/glib/include -I/usr/X11R6/include -I/sw/
    include -I/usr/X11R6/include -I/sw/include -I/sw/include
    -DGNOMELIBDIR=\"/sw/lib\" -DGNOMEDATADIR=\"/sw/
    share\" -DGNOMEBINDIR=\"/sw/bin\" -
    DGNOMELOCALSTATEDIR=\"/sw/var\" -
    DGNOMELOCALEDIR=\"/sw/lib/locale\" -
    DGNOMESYSCONFDIR=\"/sw/etc\" -DVERSION=\ "1.2.12\" -DG_LOG_DOMAIN=\"Gnome\" -traditional-cpp
    -I/sw/include -I/sw/include/gtk-1.2 -I/sw/include/glib-1.2
    -I/sw/lib/glib/include -I/usr/X11R6/include -g -O2 -Wall -
    Wunused -c gnome-magic.c -o gnome-magic.o >/dev/
    null 2>&1
    mv -f .libs/gnome-magic.lo gnome-magic.lo
    /bin/sh ../libtool --mode=compile cc -
    DHAVE_CONFIG_H -I. -I. -I.. -I.. -I./.. -
    DNEED_GNOMESUPPORT_H -I../support -I../support
    -I../intl -I../intl -I/sw/include -I/sw/lib/glib/include -I/usr/
    X11R6/include -I/sw/include/gtk-1.2 -I/sw/include/glib-
    1.2 -I/sw/lib/glib/include -I/usr/X11R6/include -I/sw/
    include -I/usr/X11R6/include -I/sw/include -I/sw/
    include -DGNOMELIBDIR=\""/sw/lib"\" -
    DGNOMEDATADIR=\""/sw/share"\" -DGNOMEBINDIR=
    \""/sw/bin"\" -DGNOMELOCALSTATEDIR=\""/sw/var"\"
    -DGNOMELOCALEDIR=\""/sw/lib/locale"\" -
    DGNOMESYSCONFDIR=\""/sw/etc"\" -DVERSION=\ ""1.2.12"\" -DG_LOG_DOMAIN=\"Gnome\" -traditional-
    cpp -I/sw/include -I/sw/include/gtk-1.2 -I/sw/include/
    glib-1.2 -I/sw/lib/glib/include -I/usr/X11R6/include -g -
    O2 -Wall -Wunused -c gnome-metadata.c
    rm -f .libs/gnome-metadata.lo
    cc -DHAVE_CONFIG_H -I. -I. -I.. -I.. -I./.. -
    DNEED_GNOMESUPPORT_H -I../support -I../support -
    I../intl -I../intl -I/sw/include -I/sw/lib/glib/include -I/usr/
    X11R6/include -I/sw/include/gtk-1.2 -I/sw/include/glib-
    1.2 -I/sw/lib/glib/include -I/usr/X11R6/include -I/sw/
    include -I/usr/X11R6/include -I/sw/include -I/sw/include
    -DGNOMELIBDIR=\"/sw/lib\" -DGNOMEDATADIR=\"/sw/
    share\" -DGNOMEBINDIR=\"/sw/bin\" -
    DGNOMELOCALSTATEDIR=\"/sw/var\" -
    DGNOMELOCALEDIR=\"/sw/lib/locale\" -
    DGNOMESYSCONFDIR=\"/sw/etc\" -DVERSION=\ "1.2.12\" -DG_LOG_DOMAIN=\"Gnome\" -traditional-cpp
    -I/sw/include -I/sw/include/gtk-1.2 -I/sw/include/glib-1.2
    -I/sw/lib/glib/include -I/usr/X11R6/include -g -O2 -Wall -
    Wunused -c gnome-metadata.c -fno-common -DPIC -
    o .libs/gnome-metadata.lo
    gnome-metadata.c: In function `init':
    gnome-metadata.c:176: warning: implicit declaration of
    function `dbopen'
    gnome-metadata.c:177: warning: assignment makes
    pointer from integer without a cast
    gnome-metadata.c: In function `metadata_set':
    gnome-metadata.c:302: warning: passing arg 2 of
    pointer to function from incompatible pointer type
    gnome-metadata.c:302: too few arguments to function
    gnome-metadata.c:329: warning: passing arg 2 of
    pointer to function from incompatible pointer type
    gnome-metadata.c:329: too few arguments to function
    gnome-metadata.c:350: warning: passing arg 2 of
    pointer to function from incompatible pointer type
    gnome-metadata.c:350: too few arguments to function
    gnome-metadata.c:357: warning: passing arg 2 of
    pointer to function from incompatible pointer type
    gnome-metadata.c:357: too few arguments to function
    gnome-metadata.c: In function `metadata_remove':
    gnome-metadata.c:389: warning: passing arg 2 of
    pointer to function from incompatible pointer type
    gnome-metadata.c:389: too few arguments to function
    gnome-metadata.c:416: warning: passing arg 2 of
    pointer to function from incompatible pointer type
    gnome-metadata.c:416: too few arguments to function
    gnome-metadata.c:433: warning: passing arg 2 of
    pointer to function from incompatible pointer type
    gnome-metadata.c:433: too few arguments to function
    gnome-metadata.c:450: warning: passing arg 2 of
    pointer to function from incompatible pointer type
    gnome-metadata.c:450: too few arguments to function
    gnome-metadata.c: In function `metadata_get_list':
    gnome-metadata.c:482: warning: passing arg 2 of
    pointer to function from incompatible pointer type
    gnome-metadata.c:482: too few arguments to function
    gnome-metadata.c: In function
    `metadata_get_no_dup':
    gnome-metadata.c:515: warning: passing arg 2 of
    pointer to function from incompatible pointer type
    gnome-metadata.c:515: too few arguments to function
    gnome-metadata.c: In function `maybe_scan_app_dir':
    gnome-metadata.c:784: warning: passing arg 3 of
    `scandir' from incompatible pointer type
    make[2]: *** [gnome-metadata.lo] Error 1
    make[1]: *** [all-recursive] Error 1
    make: *** [all-recursive-am] Error 2
    ### make failed, exit code 2
    Failed: compiling gnome-libs-1.2.12-2 failed

     
  • Logged In: NO

    I moved up to gnome-libs-1.2.13 as well, but it didn't
    compile for me. Same errors as 1.2.12. I used the same
    patch as for 1.2.12.

    Did you need to do anything special to get 1.2.13 to build
    for you?

     
  • Logged In: YES
    user_id=51640

    This is probably caused by having a custom db library
    installed, e.g. in /usr/local. I'm not sure what I can do to
    improve the situation.

     
  • Logged In: NO

    i have a workaround for this problem i experienced it when i tried to compile the libs without having all of XFree86 installed, personally i just got the binary dist 4.1.0 since compiling X with fink failed but after the binary install the gnome libs and gimp compiled and work fine

     
  • Logged In: NO

    i have a workaround for this problem i experienced it when i tried to compile the libs without having all of XFree86 installed, personally i just got the binary dist 4.1.0 since compiling X with fink failed but after the binary install the gnome libs and gimp compiled and work fine

     
  • Logged In: YES
    user_id=51640

    This is now mentioned in the FAQ. Closing the report.

     
    • status: open --> closed-wont-fix