When I try to compile the e_utils I got that error.... I had get the source from cvs today.... a few hours a go.... what can be the problem?



gcc -g -O2 -o e_util_eapp_edit eapp_edit_main.o  -L/usr/local/lib /usr/local/lib/libewl.so -L/usr/X11R6/lib -L/root/E/e17/libs/ecore/src/lib/ecore/.libs -L/root/E/e17/libs/ecore/src/lib/ecore_txt/.libs -L/root/E/e17/libs/ecore/src/lib/ecore_job/.libs -L/root/E/e17/libs/ecore/src/lib/ecore_x/.libs -L/root/E/e17/libs/ecore/src/lib/ecore_fb/.libs -L/root/E/e17/libs/ecore/src/lib/ecore_con/.libs /usr/local/lib/libemotion.so /usr/local/lib/libedje.so /usr/local/lib/libembryo.so /usr/local/lib/libecore_evas.so /usr/local/lib/libecore_x.so -lXcursor -lXp -lXinerama /usr/local/lib/libecore_job.so /usr/local/lib/libecore_ipc.so /usr/local/lib/libecore_con.so -lssl -lcrypto /usr/local/lib/libecore_txt.so /usr/local/lib/libecore_fb.so /usr/local/lib/libecore_config.so /usr/local/lib/libevas.so /usr/lib/libfreetype.so -lpng /usr/local/lib/libedb.so /usr/lib/libGL.so -lXext -lX11 -lGLU -lpthread /usr/local/lib/libecore_file.so /usr/local/lib/libecore.so -ldl /usr/local/lib/libeet.so -lz -ljpeg -lm
eapp_edit_main.o(.text+0x193): In function `_eapp_edit_save':
/root/E/e17/apps/e_utils/src/bin/eapp_edit/eapp_edit_main.c:50: undefined reference to `engrave_file_new'
eapp_edit_main.o(.text+0x1a1):/root/E/e17/apps/e_utils/src/bin/eapp_edit/eapp_edit_main.c:51: undefined reference to `engrave_file_image_dir_set'
eapp_edit_main.o(.text+0x1ae):/root/E/e17/apps/e_utils/src/bin/eapp_edit/eapp_edit_main.c:52: undefined reference to `engrave_image_new'
eapp_edit_main.o(.text+0x1bb):/root/E/e17/apps/e_utils/src/bin/eapp_edit/eapp_edit_main.c:53: undefined reference to `engrave_file_image_add'
eapp_edit_main.o(.text+0x1c0):/root/E/e17/apps/e_utils/src/bin/eapp_edit/eapp_edit_main.c:55: undefined reference to `engrave_group_new'
eapp_edit_main.o(.text+0x1cf):/root/E/e17/apps/e_utils/src/bin/eapp_edit/eapp_edit_main.c:56: undefined reference to `engrave_group_name_set'
eapp_edit_main.o(.text+0x1dc):/root/E/e17/apps/e_utils/src/bin/eapp_edit/eapp_edit_main.c:57: undefined reference to `engrave_group_max_size_set'
eapp_edit_main.o(.text+0x1e5):/root/E/e17/apps/e_utils/src/bin/eapp_edit/eapp_edit_main.c:58: undefined reference to `engrave_file_group_add'
eapp_edit_main.o(.text+0x1f1):/root/E/e17/apps/e_utils/src/bin/eapp_edit/eapp_edit_main.c:60: undefined reference to `engrave_part_new'
eapp_edit_main.o(.text+0x200):/root/E/e17/apps/e_utils/src/bin/eapp_edit/eapp_edit_main.c:61: undefined reference to `engrave_part_name_set'
eapp_edit_main.o(.text+0x20a):/root/E/e17/apps/e_utils/src/bin/eapp_edit/eapp_edit_main.c:62: undefined reference to `engrave_part_mouse_events_set'
eapp_edit_main.o(.text+0x213):/root/E/e17/apps/e_utils/src/bin/eapp_edit/eapp_edit_main.c:63: undefined reference to `engrave_group_part_add'
eapp_edit_main.o(.text+0x218):/root/E/e17/apps/e_utils/src/bin/eapp_edit/eapp_edit_main.c:65: undefined reference to `engrave_part_state_new'
eapp_edit_main.o(.text+0x229):/root/E/e17/apps/e_utils/src/bin/eapp_edit/eapp_edit_main.c:66: undefined reference to `engrave_part_state_name_set'
eapp_edit_main.o(.text+0x23d):/root/E/e17/apps/e_utils/src/bin/eapp_edit/eapp_edit_main.c:67: undefined reference to `engrave_part_state_aspect_set'
eapp_edit_main.o(.text+0x24a):/root/E/e17/apps/e_utils/src/bin/eapp_edit/eapp_edit_main.c:68: undefined reference to `engrave_part_state_image_normal_set'
eapp_edit_main.o(.text+0x253):/root/E/e17/apps/e_utils/src/bin/eapp_edit/eapp_edit_main.c:69: undefined reference to `engrave_part_state_add'
eapp_edit_main.o(.text+0x262):/root/E/e17/apps/e_utils/src/bin/eapp_edit/eapp_edit_main.c:71: undefined reference to `engrave_eet_output'
eapp_edit_main.o(.text+0x26a):/root/E/e17/apps/e_utils/src/bin/eapp_edit/eapp_edit_main.c:72: undefined reference to `engrave_file_free'
collect2: ld returned 1 exit status
make[4]: *** [e_util_eapp_edit] Error 1
make[4]: Leaving directory `/root/E/e17/apps/e_utils/src/bin/eapp_edit'
make[3]: *** [all-recursive] Error 1
make[3]: Leaving directory `/root/E/e17/apps/e_utils/src/bin'
make[2]: *** [all-recursive] Error 1
make[2]: Leaving directory `/root/E/e17/apps/e_utils/src'
make[1]: *** [all-recursive] Error 1
make[1]: Leaving directory `/root/E/e17/apps/e_utils'
make: *** [all] Error 2
bash-3.00#