------



Dear sir, 


   I  followed  all the step mention in the User Guide   i did all path variable setting   and restart 

   but when i give this command for mvn package like 

C:\users\admin>mvn package

[INFO]  Scanning  for project s…….......................

 ........................................................................

[INFO]  ………………………………………………………..

[INFO]  Build failure

[INFO]  ……………………………………………………………………

[INFO]   Total time : 0.125s

[INFO]   Finished at : Mon Mar 28 17:24:14 IST 2011-03-28

[INFO]   Final Memory :1M/15M...........................................

[INFO]  ………………………………………………………………………………..

[ERROR] The goal you specified  requires a project to executebut there is  in this directory (C:/Users/ADMIN). Please verify you invoked Maven from correct directory.--> [Help 1]

[ERROR]..................................................................

[ERROR] To see the full stack trace of errors, re-run maven with the –e switch.

[ERROR] Re –run  maven using the –x switch to enable full debug logging.

[ERROR] For  more  information about th errors and possible solutions, Please the following articles:

[ERROR] [help1] http://cwiki.apache.org/comconfluence/display maven/missing project exception

[ERROR].........................................................................



  i got this message  

Plz kindly suggest me 

With Regards

Imran Mansuri