#194 build error on SuSE 8.2

0.62
closed
None
5
2012-09-07
2004-10-02
Ashitaka
No

DOSBox 0.62 fails to build on SuSE Linux 8.2.
./configure;make gives me the following error:

Making all in dos
make[1]: Entering directory
/tmp/build/dosbox-0.62/src/dos' if g++ -DHAVE_CONFIG_H -I. -I. -I../.. -I../../include -I/usr/include/SDL -D_REENTRANT -g -O2 -MT cdrom_image.o -MD -MP -MF ".deps/cdrom_image.Tpo" \ -c -o cdrom_image.otest -f 'cdrom_image.cpp' ||
echo './'cdrom_image.cpp; \ then mv -f ".deps/cdrom_image.Tpo" ".deps/cdrom_image.Po"; \ else rm -f ".deps/cdrom_image.Tpo"; exit 1; \ fi cdrom_image.cpp: In member functionvirtual bool
CDROM_Interface_Image::AudioFile::read(Bit8u, int,
int)':
cdrom_image.cpp:90: error: Sound_Seek' undeclared (first use this function) cdrom_image.cpp:90: error: (Each undeclared identifier is reported only once for each function it appears in.) cdrom_image.cpp: In member functionvirtual int
CDROM_Interface_Image::AudioFile::getLength()':
cdrom_image.cpp:109: error: SOUND_SAMPLEFLAG_CANSEEK' undeclared (first use this function) make[1]: *** [cdrom_image.o] Error 1 make[1]: Leaving directory/tmp/build/dosbox-0.62/src/dos'
make:
** [all-recursive] Error 1

Discussion

  • Peter Veenstra
    Peter Veenstra
    2004-10-20

    Logged In: YES
    user_id=535630

    We've added a configure test to the current cvs.