compile error an v 1.2.3

Help
mobab
2005-05-11
2013-04-22
  • mobab
    mobab
    2005-05-11

    I can't compile dcfldd 1.2.3. If i make a Debian Package I get this error(s):

    sizeprobe.c: In Funktion get_dev_size:
    sizeprobe.c:63: Warnung: implicit declaration of function `ioctl'
    sizeprobe.c:63: error: `BLKGETSIZE' undeclared (first use in this function)
    sizeprobe.c:63: error: (Each undeclared identifier is reported only once
    sizeprobe.c:63: error: for each function it appears in.)
    sizeprobe.c: Auf hchster Ebene:
    sizeprobe.c:45: Warnung: `midpoint' defined but not used
    make[2]: *** [sizeprobe.o] Fehler 1
    make[2]: Leaving directory
    `/home/public/Downloads/Source/dcfldd-1.2.3'
    make[1]: *** [all] Fehler 2
    make[1]: Leaving directory
    `/home/public/Downloads/Source/dcfldd-1.2.3'
    make: *** [build-stamp] Fehler 2

    The "normal way" (configure, make) produce the same error.

    Tested on two machines, the same thing.
    My system Debian testing, gcc 3.3.5

    Greetings
    mobab

     
    • Fixed now, check out v1.2.3-1

      Hay, now I know what make looks like in german!