#12 Make fails

open
nobody
Crash (4)
5
2012-01-25
2012-01-25
Anonymous
No

When trying to make dc3dd on a Mac running OSX Lion with Xcode 4.2.1, automake 1.10.1 and autoconf 2.68 the following error shows.
This is after configure has successfully run.

> make
...
stpncpy.c:33: error: expected declaration specifiers or '...' before numeric constant
stpncpy.c:33: error: expected ')' before '!=' token
stpncpy.c:33: error: expected ')' before '?' token
make[3]: *** [stpncpy.o] Error 1
make[2]: *** [all] Error 2
make[1]: *** [all-recursive] Error 1
make: *** [all] Error 2

Discussion