Process Error. Please check log for details

Sameer
2008-01-18
2014-07-04
  • Sameer
    Sameer
    2008-01-18

    I am installing on Windows XP SP2. Server installation is successful but at the time of database creation, system is generating message "Process Error. Please check log for details".

    Sameer

     
    • whoami
      whoami
      2008-03-08

      Hello there.

      Did you get help with this? I have EXACTLY the same problem with the installation with Winxpsp2, enterpriseDB and compiere3

      Thanks

       
      • whoami
        whoami
        2008-03-08

        ooh, when I check the log, this is what it says. Installing the system was successful. Only the database has a problem:

        01:30:45.312 ProgressPanel.publish: setupTomcat: [18]
        01:30:45.312 ProgressPanel.publish: setupDeploy: [18]
        01:30:45.312   ProgressPanel.publish:      [echo] AppsDeployment= C:\Compiere2\jboss\server\compiere\deploy [18]
        01:30:45.312 ProgressPanel.publish: setup: [18]
        01:30:45.328 ProgressPanel.publish: BUILD SUCCESSFUL [18]
        01:30:45.328 ProgressPanel.publish: Total time: 1 minute 22 seconds [18]
        01:30:45.343 ProgressPanel.publish: ** Finished [18]
        01:30:45.359 ProgressPanel.finished: Worker success=true [12]
        01:30:45.359 ProgressPanel.enableUI: true [12]
        01:30:52.687 ProgressPanel.enableUI: false [12]
        01:30:52.687 ProgressPanel.cmd: Create new Database [12]

        The progress bar for installing a database reaching about 3/4 way.

        Help please.

        Thank you.

         
    • whoami
      whoami
      2008-03-09

      Hello.
      I thought maybe it was a database issue so today I tried installing the recommended oracle database.

      But I got the same error at the exact same place.

      PROCESS ERROR: PLEASE CHECK LOG FOR DETAILS

      Going to the log file, there is:

      ------------------------------------
      Starting Setup Dialog ...
      =======================================
      *** 2008-03-09 09:01:42.375 Compiere Log (CLogConsole) ***
      09:01:42.375   CLogMgt.setLevel: CONFIG
      09:01:42.703   CompierePLAF.setPLAF: Compiere - null
      09:01:43.703   SecureEngine.<init>: org.compiere.util.Secure initialized - Secure[javax.crypto.Cipher@1a16869]
      09:01:43.718   CompierePLAF.setPLAF: Compiere - Compiere Theme
      09:01:44.328 Setup.<init>: Compiere(r) Release 3.0.0_2007-11-26 - Smart ERP & CRM - (c) 1999-2007 Compiere (r); Implemen
      tation: 3.0.0 20071203-1352 - ComPiere Inc. (C) 1999-2006 Jorg Janke
      09:01:44.453 ConfigurationData.load: C:\Compiere2\CompiereEnv.properties
      09:01:48.562 ConfigVMSun.test: OK: JavaHome=C:\Program Files\Java\jdk1.5.0_14 [11]
      09:01:48.562 ConfigVMSun.test: OK: Version=1.5.0_14 [11]
      09:01:48.562 ConfigurationData.testCompiere: OK: CompiereHome = C:\Compiere2 [11]
      09:01:48.578 KeyStoreMgt.<init>: C:\Compiere2\keystore\myKeystore [11]
      09:01:48.578   KeyStoreMgt.getCertificate: Alias=compiere [11]
      09:01:48.593 ConfigurationData.testCompiere: OK: KeyStore = C:\Compiere2\keystore\myKeystore [11]
      09:01:48.593 ConfigJBoss.test: OK: AppsServer = vasdesktop/192.168.1.5 [11]
      09:01:48.593 ConfigJBoss.test: OK: Deploy Directory = C:\Compiere2\jboss\server\compiere\deploy [11]
      09:01:49.625 ConfigJBoss.test: OK: JNPPort = 1099 [11]
      09:01:50.625 ConfigJBoss.test: OK: Web Port = 8081 [11]
      09:01:51.718 ConfigJBoss.test: OK: SSL Port = 4443 [11]
      09:01:51.718 ConfigOracle.test: OK: Database Server = vasdesktop/192.168.1.5 [11]
      09:01:51.734 ConfigOracle.test: OK: Database Port = 1521 [11]
      09:01:51.984 ConfigOracle.test: OK: Connection = jdbc:oracle:thin:@//vasdesktop:1521/xe [11]
      09:01:51.984 ConfigOracle.test: OK: Database System User xe [11]
      09:01:52.203 ConfigOracle.test: OK: Database User = compiere [11]
      -----------> ConfigOracle.getWebStores: java.sql.SQLException: ORA-00942: table or view does not exist
      [11]
      09:01:52.421 ConfigOracle.test: OCI Test Skipped [11]
      -----------> ConfigurationData.testMail: Not valid:  - Illegal address [11]
      09:01:52.546 ConfigurationData.testComponents: OK: Components [11]
      09:02:10.890 ConfigVMSun.test: OK: JavaHome=C:\Program Files\Java\jdk1.5.0_14 [12]
      09:02:10.890 ConfigVMSun.test: OK: Version=1.5.0_14 [12]
      09:02:10.890 ConfigurationData.testCompiere: OK: CompiereHome = C:\Compiere2 [12]
      09:02:10.890 KeyStoreMgt.<init>: C:\Compiere2\keystore\myKeystore [12]
      09:02:10.921   KeyStoreMgt.getCertificate: Alias=compiere [12]
      09:02:10.921 ConfigurationData.testCompiere: OK: KeyStore = C:\Compiere2\keystore\myKeystore [12]
      09:02:10.921 ConfigJBoss.test: OK: AppsServer = vasdesktop/192.168.1.5 [12]
      09:02:10.937 ConfigJBoss.test: OK: Deploy Directory = C:\Compiere2\jboss\server\compiere\deploy [12]
      09:02:11.937 ConfigJBoss.test: OK: JNPPort = 1099 [12]
      09:02:13.046 ConfigJBoss.test: OK: Web Port = 8081 [12]
      09:02:14.046 ConfigJBoss.test: OK: SSL Port = 4443 [12]
      09:02:14.062 ConfigOracle.test: OK: Database Server = vasdesktop/192.168.1.5 [12]
      09:02:14.062 ConfigOracle.test: OK: Database Port = 1521 [12]
      09:02:14.078 ConfigOracle.test: OK: Connection = jdbc:oracle:thin:@//vasdesktop:1521/xe [12]
      09:02:14.093 ConfigOracle.test: OK: Database System User xe [12]
      09:02:14.109 ConfigOracle.test: OK: Database User = compiere [12]
      -----------> ConfigOracle.getWebStores: java.sql.SQLException: ORA-00942: table or view does not exist
      [12]
      09:02:14.140 ConfigOracle.test: OCI Test Skipped [12]
      -----------> ConfigurationData.testMail: Not valid:  - Illegal address [12]
      09:02:15.656 IniDialog.accept: License Accepted [12]
      09:02:15.656 ConfigurationData.testComponents: OK: Components [12]
      09:02:15.843 Ini.loadProperties: C:\Compiere2\Compiere.properties #20 [13]
      09:02:15.843 ConfigurationData.save: C:\Compiere2\CompiereEnv.properties [13]
      09:02:15.875 SecureEngine.reset:  [13]
      09:02:15.875   SecureEngine.<init>: org.compiere.util.Secure initialized - Secure[javax.crypto.Cipher@1cd66ea] [13]
      09:02:15.890   Setup.propertyChange: configuration->progress [13]
      09:02:30.703 ProgressPanel.cmd: Server Install [13]
      09:02:30.703 ProgressPanel.cmd_serverInstall: C:\Compiere2 [14]
      09:02:30.703 ProgressPanel.publish: ** Start [14]
      09:02:30.718 ProgressPanel.run: Starting Ant ... C:\Compiere2 [15]
      09:02:31.218 ProgressPanel.publish: Buildfile: C:\Compiere2\build.xml [14]
      09:02:31.218 ProgressPanel.publish: setupInit: [14]
      09:02:31.218   ProgressPanel.publish:      [echo] Compiere Server Setup =================== [14]
      09:02:31.234   ProgressPanel.publish:      [echo] COMPIERE_HOME = C:\Compiere2 [14]
      09:02:31.250   ProgressPanel.publish:      [echo] Environment   = CompiereEnv.properties [14]
      09:02:31.250   ProgressPanel.publish:      [echo] Java VM       = sun [14]
      09:02:31.250   ProgressPanel.publish:      [echo] Database      = oracleXE [14]
      09:02:31.250   ProgressPanel.publish:      [echo] Apps Server   = jboss [14]
      09:02:31.250   ProgressPanel.publish:      [echo] AppsDeployment= C:\Compiere2\jboss\server\compiere\deploy [14]
      09:02:31.250   ProgressPanel.publish:      [echo] Ant Version= Apache Ant version 1.7.0 compiled on December 13 2006 [14
      ]
      09:02:31.281   ProgressPanel.publish:      [echo] Windows=true JBoss=true Tomcat=${isAppsTomcat} WAS=${isIBMWAS} [14]
      09:02:31.484   ProgressPanel.publish:      [echo] lib/ext= ${lib.ext.jar.exists} [14]
      09:02:31.500   ProgressPanel.publish:      [echo] data/images= ${data.images.png.exists} [14]
      09:02:31.500   ProgressPanel.publish:      [echo] Found jar or png for Components= ${component.exists} [14]
      09:02:31.515 ProgressPanel.publish: secureCopy: [14]
      09:02:31.515 ProgressPanel.publish: DBcopy.win: [14]
      09:02:31.531 ProgressPanel.publish: setupWin: [14]
      09:02:31.531   ProgressPanel.publish:      [copy] Copying 1 file to C:\Compiere2\utils [14]
      09:02:31.562   ProgressPanel.publish:      [copy] Copying 1 file to C:\Compiere2\utils [14]
      09:02:31.578   ProgressPanel.publish:      [copy] Copying 1 file to C:\Compiere2\utils [14]
      09:02:31.593   ProgressPanel.publish:      [copy] Copying 1 file to C:\Compiere2\utils [14]
      09:02:31.781 ProgressPanel.publish: DBcopy.unix: [14]
      09:02:31.781 ProgressPanel.publish: setupNonWin: [14]
      09:02:31.796 ProgressPanel.publish: setupWasJar: [14]
      09:02:31.796 ProgressPanel.publish: setupComp: [14]
      09:02:31.812 ProgressPanel.publish: setupCLib: [14]
      09:02:31.812   ProgressPanel.publish:    [delete] Deleting: C:\Compiere2\lib\CompiereCLib.jar [14]
      09:02:31.812   ProgressPanel.publish:     [mkdir] Created dir: C:\Compiere2\buildCLib [14]
      09:02:31.812   ProgressPanel.publish:     [unjar] Expanding: C:\Compiere2\lib\CCTools.jar into C:\Compiere2\buildCLib [1
      4]
      09:02:35.000   ProgressPanel.publish:     [unjar] Expanding: C:\Compiere2\lib\jPDF.jar into C:\Compiere2\buildCLib [14]
      09:02:36.156   ProgressPanel.publish:     [unjar] Expanding: C:\Compiere2\lib\oracle.jar into C:\Compiere2\buildCLib [14
      ]
      09:02:38.203   ProgressPanel.publish:     [unjar] Expanding: C:\Compiere2\lib\jboss.jar into C:\Compiere2\buildCLib [14]

      09:02:42.703   ProgressPanel.publish:      [copy] Copying 1 file to C:\Compiere2\buildCLib\org\compiere\startup [14]
      09:02:43.843   ProgressPanel.publish:       [jar] Building jar: C:\Compiere2\lib\CompiereCLib.jar [14]
      09:02:49.140   ProgressPanel.publish:      [echo] KeyStore=C:\Compiere2\keystore\myKeystore - Alias=compiere [14]
      09:02:49.171   ProgressPanel.publish:   [signjar] Signing JAR: C:\Compiere2\lib\CompiereCLib.jar to C:\Compiere2\lib\Com
      piereCLib.jar as compiere [14]
      09:02:58.984   ProgressPanel.publish:   [signjar] Enter Passphrase for keystore:  [14]
      09:02:59.000   ProgressPanel.publish:      [copy] Copying 1 file to C:\Compiere2\buildCLib [14]
      09:02:59.562   ProgressPanel.publish:   [signjar] Signing JAR: C:\Compiere2\buildCLib\Compiere1.jar to C:\Compiere2\buil
      dCLib\Compiere1.jar as compiere [14]
      09:03:07.750   ProgressPanel.publish:   [signjar] Enter Passphrase for keystore:  [14]
      09:03:07.765   ProgressPanel.publish:      [copy] Copying 1 file to C:\Compiere2\lib [14]
      09:03:07.843   ProgressPanel.publish:    [delete] Deleting directory C:\Compiere2\buildCLib [14]
      09:03:11.671 ProgressPanel.publish: setupSLib: [14]
      09:03:11.671   ProgressPanel.publish:    [delete] Deleting: C:\Compiere2\lib\CompiereSLib.jar [14]
      09:03:11.671   ProgressPanel.publish:     [mkdir] Created dir: C:\Compiere2\buildSLib [14]
      09:03:11.671   ProgressPanel.publish:     [unjar] Expanding: C:\Compiere2\lib\CSTools.jar into C:\Compiere2\buildSLib [1
      4]
      09:03:14.687   ProgressPanel.publish:     [unjar] Expanding: C:\Compiere2\lib\jPDF.jar into C:\Compiere2\buildSLib [14]
      09:03:15.781   ProgressPanel.publish:     [unjar] Expanding: C:\Compiere2\lib\oracle.jar into C:\Compiere2\buildSLib [14
      ]
      09:03:17.562   ProgressPanel.publish:      [copy] Copying 1 file to C:\Compiere2\buildSLib\org\compiere\startup [14]
      09:03:17.984   ProgressPanel.publish:       [jar] Building jar: C:\Compiere2\lib\CompiereSLib.jar [14]
      09:03:21.281   ProgressPanel.publish:   [signjar] Signing JAR: C:\Compiere2\lib\CompiereSLib.jar to C:\Compiere2\lib\Com
      piereSLib.jar as compiere [14]
      09:03:28.093   ProgressPanel.publish:   [signjar] Enter Passphrase for keystore:  [14]
      09:03:28.093   ProgressPanel.publish:    [delete] Deleting directory C:\Compiere2\buildSLib [14]
      09:03:30.109   ProgressPanel.publish:   [signjar] Signing JAR: C:\Compiere2\lib\compiereRoot.jar to C:\Compiere2\lib\com
      piereRoot.jar as compiere [14]
      09:03:30.984   ProgressPanel.publish:   [signjar] Enter Passphrase for keystore:  [14]
      09:03:31.000   ProgressPanel.publish:   [signjar] Signing JAR: C:\Compiere2\lib\compiereApps.jar to C:\Compiere2\lib\com
      piereApps.jar as compiere [14]
      09:03:31.703   ProgressPanel.publish:   [signjar] Enter Passphrase for keystore:  [14]
      09:03:31.718 ProgressPanel.publish: setupWASSLib: [14]
      09:03:31.734 ProgressPanel.publish: copyJnlp: [14]
      09:03:31.734   ProgressPanel.publish:      [copy] Copying 1 file to C:\Compiere2\lib [14]
      09:03:31.750 ProgressPanel.publish: copyWasJnlp: [14]
      09:03:31.750 ProgressPanel.publish: setupLib: [14]
      09:03:31.750   ProgressPanel.publish:      [copy] Copying 1 file to C:\Compiere2\utils [14]
      09:03:31.750   ProgressPanel.publish:      [copy] Copying 1 file to C:\Compiere2\utils [14]
      09:03:31.859   ProgressPanel.publish:       [zip] Building zip: C:\Compiere2\lib\Compiere2Client.zip [14]
      09:03:33.562   ProgressPanel.publish:      [copy] Copying 1 file to C:\Compiere2 [14]
      09:03:33.578   ProgressPanel.publish:      [copy] Copying 1 file to C:\Compiere2 [14]
      09:03:33.578 ProgressPanel.publish: setupCompiereRootWar: [14]
      09:03:33.718   ProgressPanel.publish:       [zip] Building zip: C:\Compiere2\lib\compiereRoot.war [14]
      09:03:36.875 ProgressPanel.publish: setupWasCompiereRootWar: [14]
      09:03:36.875 ProgressPanel.publish: setupEAR: [14]
      09:03:36.906   ProgressPanel.publish:       [ear] Building ear: C:\Compiere2\lib\compiereRoot.ear [14]
      09:03:41.843   ProgressPanel.publish:       [zip] Building zip: C:\Compiere2\lib\compiereApps.war [14]
      09:03:44.250   ProgressPanel.publish:       [ear] Building ear: C:\Compiere2\lib\compiereApps.ear [14]
      09:03:45.890   ProgressPanel.publish:       [zip] Building zip: C:\Compiere2\lib\compiereWebStore.war [14]
      09:03:47.562   ProgressPanel.publish:       [ear] Building ear: C:\Compiere2\lib\compiereWebStore.ear [14]
      09:03:49.562   ProgressPanel.publish:       [zip] Building zip: C:\Compiere2\lib\compiereWebCM.war [14]
      09:03:51.140   ProgressPanel.publish:       [ear] Building ear: C:\Compiere2\lib\compiereWebCM.ear [14]
      09:03:52.671 ProgressPanel.publish: setupJBoss: [14]
      09:03:52.671   ProgressPanel.publish:      [copy] Copying 1 file to C:\Compiere2\jboss\server\compiere\conf [14]
      09:03:52.703   ProgressPanel.publish:      [copy] Copying 1 file to C:\Compiere2\jboss\server\compiere\conf [14]
      09:03:52.734   ProgressPanel.publish:      [copy] Copying 1 file to C:\Compiere2\jboss\server\compiere\deploy\http-invok
      er.sar\META-INF [14]
      09:03:52.765   ProgressPanel.publish:      [copy] Copying 1 file to C:\Compiere2\jboss\server\compiere\deploy\jbossweb-t
      omcat55.sar [14]
      09:03:52.765   ProgressPanel.publish:      [echo] AppsDeployment= C:\Compiere2\jboss\server\compiere\deploy [14]
      09:03:52.781   ProgressPanel.publish:      [copy] Copying 1 file to C:\Compiere2\jboss\server\compiere\deploy [14]
      09:03:54.046   ProgressPanel.publish:      [copy] Copying 1 file to C:\Compiere2\jboss\server\compiere\deploy [14]
      09:03:54.125   ProgressPanel.publish:      [copy] Copying 1 file to C:\Compiere2\jboss\server\compiere\deploy [14]
      09:03:54.718   ProgressPanel.publish:      [copy] Copying 1 file to C:\Compiere2\jboss\server\compiere\deploy [14]
      09:03:54.812 ProgressPanel.publish: setupTomcat: [14]
      09:03:54.812 ProgressPanel.publish: setupDeploy: [14]
      09:03:54.812   ProgressPanel.publish:      [echo] AppsDeployment= C:\Compiere2\jboss\server\compiere\deploy [14]
      09:03:54.812 ProgressPanel.publish: setup: [14]
      09:03:54.859 ProgressPanel.publish: BUILD SUCCESSFUL [14]
      09:03:54.859 ProgressPanel.publish: Total time: 1 minute 24 seconds [14]
      09:03:54.859 ProgressPanel.publish: ** Finished [14]
      09:03:54.890 ProgressPanel.finished: Worker success=true [13]
      09:03:54.890 ProgressPanel.enableUI: true [13]
      09:04:18.921 ProgressPanel.enableUI: false [13]
      09:04:18.921 ProgressPanel.cmd: DROP OLD and create NEW Database [13]
      09:04:18.921 ProgressPanel.publish: ** Start(vasdesktop compiere) [16]
      09:04:19.000 ProgressPanel.cmd_import: jdbc:oracle:thin:@//vasdesktop:1521/xe [16]
      09:04:19.015 ProgressPanel.publish: Dropping Database [16]
      09:04:49.546 ProgressPanel.publish: Creating Database [16]
      09:04:49.921 ProgressPanel.cmd_import:  [16]
      09:05:05.046 ProgressPanel.finished: Worker success=false [13]

      ------------------------------------

      Please assist.

      Thank you

       
    • sagarthaker
      sagarthaker
      2008-03-13

      I am also getting the same error:
      Server installation is sucessful, but database creation fails

      Here is the log file,

      14:20:11.359 ProgressPanel.publish: BUILD SUCCESSFUL [13]
      14:20:11.359 ProgressPanel.publish: Total time: 1 minute 55 seconds [13]
      14:20:11.375 ProgressPanel.publish: ** Finished [13]
      14:20:11.390 ProgressPanel.finished: Worker success=true [12]
      14:20:11.390 ProgressPanel.enableUI: true [12]
      14:20:20.328 ProgressPanel.enableUI: false [12]
      14:20:20.343 ProgressPanel.cmd: DROP OLD and create NEW Database [12]
      14:20:20.343 ProgressPanel.publish: ** Start(HJNLPT4000466 compiere) [15]
      14:20:21.906 ProgressPanel.cmd_import: jdbc:oracle:thin:@//HJNLPT4000466:1521/abcd9ir2 [15]
      14:20:21.921 ProgressPanel.publish: Dropping Database [15]
      14:20:25.937 ProgressPanel.publish: Creating Database [15]
      14:20:26.062 ProgressPanel.cmd_import:  [15]
      14:21:08.000 ProgressPanel.finished: Worker success=false [12]

      *** 2008-03-13 14:25:12.218 Compiere Log (CLogFile) ***

      Please help.

      Regards,

      Sagar

       
    • sagarthaker
      sagarthaker
      2008-03-13

      I think the issue is, when it tries to import data, it fails.
      This happens because there is no expat.dmp file supplied with installation.

      Does anybody have any idea how to get this .dmp file for creating table structure etc.

      Regards,

      Sagar

       
    • sagarthaker
      sagarthaker
      2008-03-14

      Found the reason for error on some other forum. It happens because Compiere try to connect to internet while creating database. Since I am using proxy, it fails to connect the net and aborts the installation.

      Sagar

       
  • I make the installation with windows 7/64
    using the Oracle XE database

    I get same Process error and this is the log file:

    0: Start
    1: Buildfile: C:\Compiere2\build.xml
    2: setupInit:
    2:
    [echo] Compiere Server Setup ===================
    2:
    [echo] COMPIERE_HOME = ${env.COMPIERE_HOME}
    2:
    [echo] Environment = CompiereEnv.properties
    2:
    [echo] Java VM = sun
    2:
    [echo] Database = oracleXE
    2:
    [echo] Apps Server = jboss
    2:
    [echo] AppsDeployment= C:\Compiere2\jboss\server\compiere\deploy
    2:
    [echo] Ant Version = Apache Ant version 1.7.0 compiled on December 13 2006
    2:
    [echo] Java Home = C:\Program Files\Java\jre6
    2:
    [echo] Java Version = 1.6.0_43 Sun Microsystems Inc.
    2:
    [echo] Windows=true JBoss=true Tomcat=${isAppsTomcat} WAS=${isIBMWAS}
    2:
    [echo] BaseJars=
    2:
    [echo] lib/ext= ${lib.ext.jar.exists}
    2:
    [echo] data/images= ${data.images.png.exists}
    3: setupCompiere:
    3:
    [mkdir] Created dir: C:\Compiere2\buildCompiere\org\compiere
    3:
    [copy] Copying 1 file to C:\Compiere2\buildCompiere\org\compiere
    3:
    [copy] Copying C:\Compiere2\lib\CompiereSecure.properties to C:\Compiere2\buildCompiere\org\compiere\CompiereSecure.properties
    3:
    [jar] Updating jar: C:\Compiere2\lib\Compiere.jar
    3:
    [delete] Deleting directory C:\Compiere2\buildCompiere
    4: secureCopy:
    5: DBcopy.win:
    6: setupWin:
    6:
    [copy] Copying 1 file to C:\Compiere2\utils
    6:
    [copy] Copying 1 file to C:\Compiere2\utils
    6:
    [copy] Copying 1 file to C:\Compiere2\utils
    6:
    [copy] Copying 1 file to C:\Compiere2\utils
    7: DBcopy.unix:
    8: setupNonWin:
    9: setupWasJar:
    10: setupComp:
    11: setupCLib:
    11:
    [delete] Deleting: C:\Compiere2\lib\CompiereCLib.jar
    11:
    [unjar] Expanding: C:\Compiere2\lib\CCTools.jar into C:\Compiere2\buildCLib
    11:
    [unjar] Expanding: C:\Compiere2\lib\jPDF.jar into C:\Compiere2\buildCLib
    11:
    [unjar] Expanding: C:\Compiere2\lib\oracle.jar into C:\Compiere2\buildCLib
    11:
    [unjar] Expanding: C:\Compiere2\lib\jboss.jar into C:\Compiere2\buildCLib
    11:
    [copy] Copying 1 file to C:\Compiere2\buildCLib\org\compiere\startup
    11:
    [jar] Building jar: C:\Compiere2\lib\CompiereCLib.jar
    11:
    [echo] KeyStore=C:\Compiere2\keystore\myKeystore - Alias=compiere
    11:
    [signjar] Signing JAR: C:\Compiere2\lib\CompiereCLib.jar to C:\Compiere2\lib\CompiereCLib.jar as compiere
    12: BUILD FAILED
    13: C:\Compiere2\build.xml:365: Execute failed: java.io.IOException: Cannot run program "jarsigner.exe": CreateProcess error=2, The system cannot find the file specified
    14: Total time: 38 seconds
    24:
    Finished

    it seems problem comes from "jarsigner"...
    I am not using a proxy...

    thanks for your help