#13 Compile error (debian)

open
nobody
None
5
2014-08-21
2007-03-09
Anonymous
No

c-71-199-245-158:/home/matthew/comical-0.8# make
make -C src
make[1]: Entering directory /home/matthew/comical-0.8/src' ccwx-config --cxxflags-O2 -Wall -pipe -D_UNIX -I../unrar -I../unzip -c -o ComicalApp.o ComicalApp.cpp In file included from ComicalFrame.h:38, from ComicalManager.h:32, from ComicalApp.h:32, from ComicalApp.cpp:28: ComicalBrowser.h:32:22: wx/vlbox.h: No such file or directory In file included from ComicalBrowser.h:41, from ComicalFrame.h:38, from ComicalManager.h:32, from ComicalApp.h:32, from ComicalApp.cpp:28: ComicBook.h:41:23: wx/arrstr.h: No such file or directory In file included from ComicBook.h:44, from ComicalBrowser.h:41, from ComicalFrame.h:38, from ComicalManager.h:32, from ComicalApp.h:32, from ComicalApp.cpp:28: Resize.h: In constructorCWeightsTable::CWeightsTable(CGenericFilter, long
unsigned int, long unsigned int, double)':
Resize.h:123: error: parse error before ;' token Resize.h:126: error: parse error before;' token
Resize.h: At global scope:
Resize.h:132: error: parse error at end of saved function text
In file included from ComicalBrowser.h:41,
from ComicalFrame.h:38,
from ComicalManager.h:32,
from ComicalApp.h:32,
from ComicalApp.cpp:28:
ComicBook.h: In member function void ComicBook::Connect(int, int, int, void (wxObject::*)(wxEvent&), wxObject*, wxEvtHandler*)': ComicBook.h:89: error: no matching function for call towxEvtHandler::Connect(
int&, int&, wxEventType&, void (wxObject::
&)(wxEvent&), wxObject&,
wxEvtHandler
&)'
/usr/include/wx/event.h:2027: error: candidates are: void
wxEvtHandler::Connect(int, int, int, void (wxObject::)(wxEvent&),
wxObject
)
/usr/include/wx/event.h:2033: error: void
wxEvtHandler::Connect(int, int, void (wxObject::)(wxEvent&), wxObject)
ComicBook.h: In member function void ComicBook::Connect(int, int, void (wxObject::*)(wxEvent&), wxObject*, wxEvtHandler*)': ComicBook.h:91: error: no matching function for call towxEvtHandler::Connect(
int&, wxEventType&, void (wxObject::&)(wxEvent&), wxObject&,
wxEvtHandler&)'
/usr/include/wx/event.h:2027: error: candidates are: void
wxEvtHandler::Connect(int, int, int, void (wxObject::
)(wxEvent&),
wxObject)
/usr/include/wx/event.h:2033: error: void
wxEvtHandler::Connect(int, int, void (wxObject::
)(wxEvent&), wxObject)
ComicBook.h: In member function void ComicBook::Connect(int, void (wxObject::*)(wxEvent&), wxObject*, wxEvtHandler*)': ComicBook.h:93: error: no matching function for call towxEvtHandler::Connect(
wxEventType&, void (wxObject::
&)(wxEvent&), wxObject&, wxEvtHandler&)'
/usr/include/wx/event.h:2027: error: candidates are: void
wxEvtHandler::Connect(int, int, int, void (wxObject::)(wxEvent&),
wxObject
)
/usr/include/wx/event.h:2033: error: void
wxEvtHandler::Connect(int, int, void (wxObject::)(wxEvent&), wxObject)
ComicBook.h: In member function bool ComicBook::Disconnect(int, void (wxObject::*)(wxEvent&), wxObject*, wxEvtHandler*)': ComicBook.h:95: error: no matching function for call towxEvtHandler::
Disconnect(wxEventType&, void (wxObject::&)(wxEvent&), wxObject&,
wxEvtHandler&)'
/usr/include/wx/event.h:2037: error: candidates are: bool
wxEvtHandler::Disconnect(int, int, int, void (wxObject::
)(wxEvent&),
wxObject)
/usr/include/wx/event.h:2043: error: bool
wxEvtHandler::Disconnect(int, int, void (wxObject::
)(wxEvent&), wxObject)
ComicBook.h: In member function bool ComicBook::Disconnect(int, int, void (wxObject::*)(wxEvent&), wxObject*, wxEvtHandler*)': ComicBook.h:97: error: no matching function for call towxEvtHandler::
Disconnect(int&, wxEventType&, void (wxObject::
&)(wxEvent&), wxObject&,
wxEvtHandler
&)'
/usr/include/wx/event.h:2037: error: candidates are: bool
wxEvtHandler::Disconnect(int, int, int, void (wxObject::)(wxEvent&),
wxObject
)
/usr/include/wx/event.h:2043: error: bool
wxEvtHandler::Disconnect(int, int, void (wxObject::)(wxEvent&), wxObject)
ComicBook.h: In member function bool ComicBook::Disconnect(int, int, int, void (wxObject::*)(wxEvent&), wxObject*, wxEvtHandler*)': ComicBook.h:99: error: no matching function for call towxEvtHandler::
Disconnect(int&, int&, wxEventType&, void (wxObject::&)(wxEvent&),
wxObject
&, wxEvtHandler&)'
/usr/include/wx/event.h:2037: error: candidates are: bool
wxEvtHandler::Disconnect(int, int, int, void (wxObject::
)(wxEvent&),
wxObject)
/usr/include/wx/event.h:2043: error: bool
wxEvtHandler::Disconnect(int, int, void (wxObject::
)(wxEvent&), wxObject)
In file included from ComicalFrame.h:38,
from ComicalManager.h:32,
from ComicalApp.h:32,
from ComicalApp.cpp:28:
ComicalBrowser.h: At global scope:
ComicalBrowser.h:45: error: parse error before {' token ComicalBrowser.h:49: error: destructors must be member functions ComicalBrowser.h:55: error: parse error beforeprivate'
ComicalBrowser.h:58: error: virtual outside class declaration
ComicalBrowser.h:58: error: non-member function wxCoord OnMeasureItem(unsigned int)' cannot haveconst' method qualifier
ComicalBrowser.h:67: error: parse error before private' ComicalBrowser.h:67: error: virtual outside class declaration ComicalBrowser.h:67: error: non-member functionconst wxEventTable

GetEventTable()' cannot have const' method qualifier ComicalBrowser.h:68: error: parse error before}' token
In file included from ComicalManager.h:32,
from ComicalApp.h:32,
from ComicalApp.cpp:28:
ComicalFrame.h:103: error: syntax error before *' token make[1]: *** [ComicalApp.o] Error 1 make[1]: Leaving directory/home/matthew/comical-0.8/src'
make: *** [src/ComicalApp.o] Error 2

Discussion