Iam getting the following error during compilation .. COULD SOMEONE HELP ?
make
make  all-recursive
make[1]: Entering directory `/usr/clint-0.1.2'
Making all in doc
make[2]: Entering directory `/usr/clint-0.1.2/doc'
make[2]: Nothing to be done for `all'.
make[2]: Leaving directory `/usr/clint-0.1.2/doc'
Making all in lib
make[2]: Entering directory `/usr/clint-0.1.2/lib'
Making all in python
make[3]: Entering directory `/usr/clint-0.1.2/lib/python'
/bin/sh ../../libtool --mode=compile c++ -DHAVE_CONFIG_H -I. -I. -I../..    -foperator-names -Wall -pedantic -ansi -g -O2 -I/usr/include/python2.4 -c -o module.lo `test -f module.cc || echo './'`module.cc
rm -f .libs/module.lo
c++ -DHAVE_CONFIG_H -I. -I. -I../.. -foperator-names -Wall -pedantic -ansi -g -O2 -I/usr/include/python2.4 -c module.cc  -fPIC -DPIC -o .libs/module.lo
In file included from /usr/lib/gcc/i386-redhat-linux/4.0.0/../../../../include/c++/4.0.0/backward/strstream:51,
                 from python.h:10,
                 from module.cc:1:
/usr/lib/gcc/i386-redhat-linux/4.0.0/../../../../include/c++/4.0.0/backward/backward_warning.h:32:2: warning: #warning This file includes at least one deprecated or antiquated header. Please consider using one of the 32 headers found in section 17.4.1.2 of the C++ standard. Examples include substituting the <X> header for the <X.h> header for C++ includes, or <iostream> instead of the deprecated header <iostream.h>. To disable this warning use -Wno-deprecated.
/usr/include/python2.4/intobject.h:41: error: ISO C++ does not support 'long long'
/usr/include/python2.4/longobject.h:37: error: ISO C++ does not support 'long long'
/usr/include/python2.4/longobject.h:38: error: ISO C++ does not support 'long long'
/usr/include/python2.4/longobject.h:39: error: ISO C++ does not support 'long long'
/usr/include/python2.4/longobject.h:40: error: ISO C++ does not support 'long long'
/usr/include/python2.4/longobject.h:41: error: ISO C++ does not support 'long long'
python.h:469: error: expected template-name before '<' token
python.h:469: error: expected `{' before '<' token
python.h:469: error: expected unqualified-id before '<' token
python.h:513: error: expected template-name before '<' token
python.h:513: error: expected `{' before '<' token
python.h:513: error: expected unqualified-id before '<' token
module.cc: In member function 'python::Object python::Module::run_method(std::string, std::string, ...)':
module.cc:34: warning: second parameter of 'va_start' not last named argument
make[3]: *** [module.lo] Error 1
make[3]: Leaving directory `/usr/clint-0.1.2/lib/python'
make[2]: *** [all-recursive] Error 1
make[2]: Leaving directory `/usr/clint-0.1.2/lib'
make[1]: *** [all-recursive] Error 1
make[1]: Leaving directory `/usr/clint-0.1.2'
make: *** [all-recursive-am] Error 2