Hi,

I've using GNU Emacs 23.0.90.1 and CEDET CVS. The following errors occur when i tried to compile it.


In toplevel form:
semantic-symref-filter.el:36:13:Error: Given parent class srecode-dictionary-compound-value is not a class
make[2]: *** [symref] Error 1
make[2]: Leaving directory `/home/bread/.emacs.d/site-lisp/cedet/semantic/symref'
make[1]: *** [Symref] Error 2
make[1]: Leaving directory `/home/bread/.emacs.d/site-lisp/cedet/semantic'
make: *** [semantic] Error 2

Plz let me know if more information is needed.

--
Zhiqiu Kong (孔直秋)

EDA Labs
Dept. Computer Science & Technology
Tsinghua University
P.R China
100084