#1340 org.openscience.cdk.atomtype.ReactionStructuresTest fail

master
closed
nobody
None
1
2014-05-02
2014-04-07
No

fcd9050101d3

Tests run: 22, Failures: 1, Errors: 0, Skipped: 0, Time elapsed: 0.02 sec <<< FAILURE! - in org.openscience.cdk.atomtype.ReactionStructuresTest
testM24(org.openscience.cdk.atomtype.ReactionStructuresTest) Time elapsed: 0.004 sec <<< FAILURE!
java.lang.AssertionError: Missing atom type for: Atom(1009138431, S:C, AtomType(1009138431, FC:0, Isotope(1009138431, Element(1009138431, S:C, AN:6)))) 0 expected: C.sp3
at org.junit.Assert.fail(Assert.java:88)
at org.junit.Assert.assertTrue(Assert.java:41)
at org.junit.Assert.assertNotNull(Assert.java:621)
at org.openscience.cdk.atomtype.ReactionStructuresTest.testM24(ReactionStructuresTest.java:797)

Results :

Failed tests:
ReactionStructuresTest.testM24:797 Missing atom type for: Atom(1009138431, S:C, AtomType(1009138431, FC:0, Isotope(1009138431, Element(1009138431, S:C, AN:6)))) 0 expected: C.sp3

Tests run: 716, Failures: 1, Errors: 0, Skipped: 0

Discussion

    • status: open --> closed