Work at SourceForge, help us to make it a better place! We have an immediate need for a Support Technician in our San Francisco or Denver office.

Close

#41 ubuntu 9.4 - errors from make test

closed-works-for-me
Sean Morrison
5
2009-12-11
2009-12-11
Anonymous
No

Hi,
trying to compile brlcad 7.16.2 on ubuntu 9.4 jaunty on a Dell Inspiron 6000 (Centrino 1.73 GHz 1.5GB)
had to add libxi from synaptic package manager before ./configure (without --enable-optimize) was OK
and make appeared to terminate OK (35 min build time)
make benchmark gives :
"""
Total testing time elapsed: 7 minutes

The following files have been generated and/or modified:
*.log ..... final log files for each individual raytrace test
*.pix ..... final pix image files for each individual raytrace test
*.log.* ... log files for previous frames and raytrace tests
*.pix.* ... pix image files for previous frames and raytrace tests
summary ... performance results summary, 2 lines per run

Summary:
Abs insp6000 213998.89 96434.81 95737.52 72852.06 92400.25105751.68 112862.53 Fri Dec 11 13:29:27 GMT 2009
*vgr insp6000 1561.92 1438.03 1707.46 1365.29 1307.11 7.13 1231.15

#*#*#*#*#*#*#*#*#*#*#*#*#*#*#*#*#*#*#*#*#*#*#*#*#*#*#*#*#*#*#*#*#*#*#*#*#*#*#*#
Benchmark results indicate an approximate VGR performance metric of 1231
Logarithmic VGR metric is 3.09 (natural logarithm is 7.12)
#*#*#*#*#*#*#*#*#*#*#*#*#*#*#*#*#*#*#*#*#*#*#*#*#*#*#*#*#*#*#*#*#*#*#*#*#*#*#*#
...
"""
thus looks OK

However make test flags various errors :

...
ERROR: E reported an error on default use
Output: Using Tcl library at /home/frederic/Desktop/brlcad-7.16.2/src/other/tcl/library

ERROR: Usage: E [-C#/#/# -s] objects(s)
...
...draw
ERROR: draw reported an error on default use
Output: Using Tcl library at /home/frederic/Desktop/brlcad-7.16.2/src/other/tcl/library

ERROR: Usage: draw <[-R -C#/#/# -s] objects> | <-o -A attribute name/value pairs>
...
ERROR: e reported an error on default use
Output: Using Tcl library at /home/frederic/Desktop/brlcad-7.16.2/src/other/tcl/library

ERROR: Usage: e <[-R -C#/#/# -s] objects> | <-o -A attribute name/value pairs>
...
ERROR: ev reported an error on default use
Output: Using Tcl library at /home/frederic/Desktop/brlcad-7.16.2/src/other/tcl/library

ERROR: Usage: ev <[-R -C#/#/# -s] objects> | <-o -A attribute name/value pairs>
...
ERROR: garbage_collect reported an error on default use
Output: Using Tcl library at /home/frederic/Desktop/brlcad-7.16.2/src/other/tcl/library

Keeping clean database to /usr/tmp/29656_mged.g
ERROR: missing file or object names
Usage: keep [-R] file object(s)
....
-> mged check FAILED
+++ mged test complete.
/bin/sh ../regress/moss.sh ..
rendering moss...
moss.pix 0 off by many
moss.pix 0 off by many
-> moss.sh succeeded
+++ moss test complete.
/bin/sh ../regress/lights.sh ..
rendering lights...
lights.pix 0 off by many
-> lights.sh succeeded
+++ lights test complete.
/bin/sh ../regress/solids.sh ..
rendering solids...
43775 off by many
solids.rt.pix 43775 off by many
-> solids.sh FAILED
+++ solids test complete.
/bin/sh ../regress/shaders.sh ..
rendering shaders...
shaders.rt.pix 428753 off by many
-> shaders.sh FAILED
+++ shaders test complete.
/bin/sh ../regress/spdi.sh ..
rendering...
spdi.pix 0 off by many
-> spdi.sh succeeded
+++ spdi test complete.
/bin/sh ../regress/iges.sh ..
0
g-iges/iges-g completed successfully
g-iges/iges-g completed successfully
-> iges.sh succeeded
+++ iges test complete.
/bin/sh ../regress/weight.sh ..
-> weight.sh succeeded
+++ weight test complete.
...

Anything I can do ... and is it worthwhile continuing with make install ?
Thanks

Discussion

  • Sean Morrison
    Sean Morrison
    2009-12-11

    Don't worry about the make test failures. Those are really only intended for dev use and only give useful reports under certain controlled configuration environments. If benchmark works for you (which it did) and mged runs, then you should be good to go.

     
  • Sean Morrison
    Sean Morrison
    2009-12-11

    • assigned_to: nobody --> brlcad
    • status: open --> closed-works-for-me